EESchema Schematic File Version 2
LIBS:power
LIBS:device
LIBS:transistors
LIBS:conn
LIBS:linear
LIBS:regul
LIBS:74xx
LIBS:cmos4000
LIBS:adc-dac
LIBS:memory
LIBS:xilinx
LIBS:special
LIBS:microcontrollers
LIBS:dsp
LIBS:microchip
LIBS:analog_switches
LIBS:motorola
LIBS:texas
LIBS:intel
LIBS:audio
LIBS:interface
LIBS:digital-audio
LIBS:philips
LIBS:display
LIBS:cypress
LIBS:siliconi
LIBS:opto
LIBS:atmel
LIBS:contrib
LIBS:valves
LIBS:mosfet
LIBS:96boards-uart-cache
EELAYER 27 0
EELAYER END
$Descr A4 11693 8268
encoding utf-8
Sheet 1 1
Title ""
Date "21 feb 2015"
Rev ""
Comp ""
Comment1 ""
Comment2 ""
Comment3 ""
Comment4 ""
$EndDescr
$Comp
L CONN_6 P2
U 1 1 54E6539B
P 9900 3200
F 0 "P2" V 9850 3200 60  0000 C CNN
F 1 "CONN_6" V 9950 3200 60  0000 C CNN
F 2 "" H 9900 3200 60  0000 C CNN
F 3 "" H 9900 3200 60  0000 C CNN
	1    9900 3200
	1    0    0    -1  
$EndComp
$Comp
L GND #PWR01
U 1 1 54E65416
P 10300 3000
F 0 "#PWR01" H 10300 3000 30  0001 C CNN
F 1 "GND" H 10300 2930 30  0001 C CNN
F 2 "" H 10300 3000 60  0000 C CNN
F 3 "" H 10300 3000 60  0000 C CNN
	1    10300 3000
	1    0    0    -1  
$EndComp
$Comp
L GND #PWR02
U 1 1 54E654DB
P 3000 3000
F 0 "#PWR02" H 3000 3000 30  0001 C CNN
F 1 "GND" H 3000 2930 30  0001 C CNN
F 2 "" H 3000 3000 60  0000 C CNN
F 3 "" H 3000 3000 60  0000 C CNN
	1    3000 3000
	1    0    0    -1  
$EndComp
Wire Wire Line
	1900 2800 1700 2800
Wire Wire Line
	1900 3000 1100 3000
Wire Wire Line
	1100 3000 1100 2500
Text Label 1100 2500 0    60   ~ 0
UART0_TXD_LV
Wire Wire Line
	1000 2400 1000 3100
Wire Wire Line
	1000 3100 1900 3100
Text Label 1000 2400 0    60   ~ 0
UART0_RXD_LV
Wire Wire Line
	10300 3000 10300 2700
Wire Wire Line
	10300 2700 9400 2700
Wire Wire Line
	9400 2700 9400 2950
Wire Wire Line
	9400 2950 9550 2950
Wire Wire Line
	8700 3350 9550 3350
$Comp
L +1.8V #PWR03
U 1 1 54E79659
P 1450 4350
F 0 "#PWR03" H 1450 4490 20  0001 C CNN
F 1 "+1.8V" H 1450 4460 30  0000 C CNN
F 2 "" H 1450 4350 60  0000 C CNN
F 3 "" H 1450 4350 60  0000 C CNN
	1    1450 4350
	1    0    0    -1  
$EndComp
Wire Wire Line
	1450 4350 1450 4500
Wire Wire Line
	1450 4500 1900 4500
$Comp
L VCC #PWR04
U 1 1 54E7D28D
P 9250 2500
F 0 "#PWR04" H 9250 2600 30  0001 C CNN
F 1 "VCC" H 9250 2600 30  0000 C CNN
F 2 "" H 9250 2500 60  0000 C CNN
F 3 "" H 9250 2500 60  0000 C CNN
	1    9250 2500
	1    0    0    -1  
$EndComp
Wire Wire Line
	9250 2500 9250 3150
Wire Wire Line
	9250 3150 9550 3150
$Comp
L VCC #PWR05
U 1 1 54E7D2F2
P 6100 1450
F 0 "#PWR05" H 6100 1550 30  0001 C CNN
F 1 "VCC" H 6100 1550 30  0000 C CNN
F 2 "" H 6100 1450 60  0000 C CNN
F 3 "" H 6100 1450 60  0000 C CNN
	1    6100 1450
	1    0    0    -1  
$EndComp
$Comp
L +1.8V #PWR06
U 1 1 54E7D310
P 5050 1450
F 0 "#PWR06" H 5050 1590 20  0001 C CNN
F 1 "+1.8V" H 5050 1560 30  0000 C CNN
F 2 "" H 5050 1450 60  0000 C CNN
F 3 "" H 5050 1450 60  0000 C CNN
	1    5050 1450
	1    0    0    -1  
$EndComp
$Comp
L R R1
U 1 1 54E7D31F
P 5050 2000
F 0 "R1" V 5130 2000 40  0000 C CNN
F 1 "R" V 5057 2001 40  0000 C CNN
F 2 "~" V 4980 2000 30  0000 C CNN
F 3 "~" H 5050 2000 30  0000 C CNN
	1    5050 2000
	1    0    0    -1  
$EndComp
Wire Wire Line
	5050 2400 5050 2250
Wire Wire Line
	5500 1600 5500 2100
$Comp
L R R3
U 1 1 54E7D3D1
P 6100 2000
F 0 "R3" V 6180 2000 40  0000 C CNN
F 1 "R" V 6107 2001 40  0000 C CNN
F 2 "~" V 6030 2000 30  0000 C CNN
F 3 "~" H 6100 2000 30  0000 C CNN
	1    6100 2000
	1    0    0    -1  
$EndComp
Wire Wire Line
	6100 1450 6100 1750
Wire Wire Line
	6100 2250 6100 2400
Wire Wire Line
	5750 2400 8700 2400
Connection ~ 5050 2400
Connection ~ 6100 2400
Wire Wire Line
	5500 1600 5050 1600
Wire Wire Line
	5050 1450 5050 1750
Connection ~ 5050 1600
$Comp
L VCC #PWR07
U 1 1 54E7D846
P 6100 3100
F 0 "#PWR07" H 6100 3200 30  0001 C CNN
F 1 "VCC" H 6100 3200 30  0000 C CNN
F 2 "" H 6100 3100 60  0000 C CNN
F 3 "" H 6100 3100 60  0000 C CNN
	1    6100 3100
	1    0    0    -1  
$EndComp
$Comp
L +1.8V #PWR08
U 1 1 54E7D84C
P 5050 3100
F 0 "#PWR08" H 5050 3240 20  0001 C CNN
F 1 "+1.8V" H 5050 3210 30  0000 C CNN
F 2 "" H 5050 3100 60  0000 C CNN
F 3 "" H 5050 3100 60  0000 C CNN
	1    5050 3100
	1    0    0    -1  
$EndComp
$Comp
L R R2
U 1 1 54E7D852
P 5050 3650
F 0 "R2" V 5130 3650 40  0000 C CNN
F 1 "R" V 5057 3651 40  0000 C CNN
F 2 "~" V 4980 3650 30  0000 C CNN
F 3 "~" H 5050 3650 30  0000 C CNN
	1    5050 3650
	1    0    0    -1  
$EndComp
Wire Wire Line
	5050 4050 5050 3900
Wire Wire Line
	5500 3250 5500 3750
$Comp
L R R4
U 1 1 54E7D85A
P 6100 3650
F 0 "R4" V 6180 3650 40  0000 C CNN
F 1 "R" V 6107 3651 40  0000 C CNN
F 2 "~" V 6030 3650 30  0000 C CNN
F 3 "~" H 6100 3650 30  0000 C CNN
	1    6100 3650
	1    0    0    -1  
$EndComp
Wire Wire Line
	6100 3100 6100 3400
Wire Wire Line
	6100 3900 6100 4050
Wire Wire Line
	5500 3250 5050 3250
Wire Wire Line
	5050 3100 5050 3400
Connection ~ 5050 3250
Wire Wire Line
	1000 2400 5350 2400
Wire Wire Line
	3850 4050 5350 4050
Wire Wire Line
	5750 4050 8700 4050
Connection ~ 5050 4050
Connection ~ 6100 4050
$Comp
L DMN601DMK Q1
U 1 1 54E7E6E1
P 5550 2300
F 0 "Q1" H 5550 2151 40  0000 R CNN
F 1 "DMN601DMK" H 5550 2450 40  0000 R CNN
F 2 "SOT-26" H 5420 2402 29  0000 C CNN
F 3 "" H 5550 2300 60  0000 C CNN
	1    5550 2300
	0    1    1    0   
$EndComp
$Comp
L DMN601DMK Q1
U 2 1 54E7E70A
P 5550 3950
F 0 "Q1" H 5550 3801 40  0000 R CNN
F 1 "DMN601DMK" H 5550 4100 40  0000 R CNN
F 2 "SOT-26" H 5420 4052 29  0000 C CNN
F 3 "" H 5550 3950 60  0000 C CNN
	2    5550 3950
	0    1    1    0   
$EndComp
Wire Wire Line
	8700 2400 8700 3250
Wire Wire Line
	8700 3250 9550 3250
Wire Wire Line
	8700 4050 8700 3350
Wire Wire Line
	3850 2500 3850 4050
Wire Wire Line
	1100 2500 3850 2500
$Comp
L CONN_20X2 P1
U 1 1 54E6538C
P 2300 3750
F 0 "P1" H 2300 4800 60  0000 C CNN
F 1 "CONN_20X2" V 2300 3750 50  0000 C CNN
F 2 "" H 2300 3750 60  0000 C CNN
F 3 "" H 2300 3750 60  0000 C CNN
	1    2300 3750
	1    0    0    -1  
$EndComp
Wire Wire Line
	1700 2800 1700 2600
Wire Wire Line
	1700 2600 3000 2600
Wire Wire Line
	3000 2600 3000 3000
Wire Wire Line
	2700 2800 3000 2800
Connection ~ 3000 2800
Text Label 7350 2400 0    60   ~ 0
UART0_RXD_HV
Text Label 7400 4050 0    60   ~ 0
UART0_TXD_HV
$EndSCHEMATC
