module git.codelinaro.org/linaro/dcap/cca-demos/cca-workload-attestation-poc

go 1.21

require (
	github.com/google/go-configfs-tsm v0.2.2
	github.com/lestrrat-go/jwx/v2 v2.0.8
	github.com/veraison/apiclient v0.3.0
	github.com/veraison/ccatoken v1.3.1
	github.com/veraison/ear v1.1.2
)

require (
	github.com/davecgh/go-spew v1.1.1 // indirect
	github.com/decred/dcrd/dcrec/secp256k1/v4 v4.1.0 // indirect
	github.com/fxamacker/cbor/v2 v2.5.0 // indirect
	github.com/goccy/go-json v0.9.11 // indirect
	github.com/golang/protobuf v1.5.3 // indirect
	github.com/huandu/xstrings v1.3.3 // indirect
	github.com/lestrrat-go/blackmagic v1.0.1 // indirect
	github.com/lestrrat-go/httpcc v1.0.1 // indirect
	github.com/lestrrat-go/httprc v1.0.4 // indirect
	github.com/lestrrat-go/iter v1.0.2 // indirect
	github.com/lestrrat-go/option v1.0.0 // indirect
	github.com/mitchellh/mapstructure v1.5.0 // indirect
	github.com/moogar0880/problems v0.1.1 // indirect
	github.com/pmezard/go-difflib v1.0.0 // indirect
	github.com/stretchr/testify v1.8.2 // indirect
	github.com/veraison/cmw v0.1.0 // indirect
	github.com/veraison/eat v0.0.0-20220117140849-ddaf59d69f53 // indirect
	github.com/veraison/go-cose v1.3.0-rc.1 // indirect
	github.com/veraison/psatoken v1.2.1-0.20240912124429-aec3ece7886e // indirect
	github.com/x448/float16 v0.8.4 // indirect
	go.uber.org/multierr v1.11.0 // indirect
	golang.org/x/crypto v0.12.0 // indirect
	golang.org/x/net v0.14.0 // indirect
	golang.org/x/oauth2 v0.11.0 // indirect
	google.golang.org/appengine v1.6.7 // indirect
	google.golang.org/protobuf v1.31.0 // indirect
	gopkg.in/yaml.v3 v3.0.1 // indirect
)
