module github.com/containerd/containerd/integration/client

go 1.19

require (
	github.com/Microsoft/hcsshim v0.9.12
	github.com/Microsoft/hcsshim/test v0.0.0-20210408205431-da33ecd607e1
	github.com/containerd/cgroups v1.0.4
	github.com/containerd/containerd v1.6.32 // the actual version of containerd is replaced with the code at the root of this repository
	github.com/containerd/continuity v0.3.0
	github.com/containerd/errdefs v0.1.0
	github.com/containerd/go-runc v1.0.0
	github.com/containerd/log v0.1.0
	github.com/containerd/ttrpc v1.1.2
	github.com/containerd/typeurl v1.0.2
	github.com/gogo/protobuf v1.3.2
	github.com/opencontainers/go-digest v1.0.0
	github.com/opencontainers/image-spec v1.1.0
	github.com/opencontainers/runtime-spec v1.0.3-0.20210326190908-1c3f411f0417
	github.com/sirupsen/logrus v1.9.3
	github.com/stretchr/testify v1.8.4
	golang.org/x/sys v0.18.0
)

require (
	dario.cat/mergo v1.0.0 // indirect
	github.com/Microsoft/go-winio v0.5.3 // indirect
	github.com/cilium/ebpf v0.7.0 // indirect
	github.com/containerd/console v1.0.3 // indirect
	github.com/containerd/fifo v1.0.0 // indirect
	github.com/coreos/go-systemd/v22 v22.3.2 // indirect
	github.com/davecgh/go-spew v1.1.1 // indirect
	github.com/docker/go-events v0.0.0-20190806004212-e31b211e4f1c // indirect
	github.com/docker/go-units v0.4.0 // indirect
	github.com/godbus/dbus/v5 v5.0.6 // indirect
	github.com/gogo/googleapis v1.4.0 // indirect
	github.com/golang/groupcache v0.0.0-20210331224755-41bb18bfe9da // indirect
	github.com/golang/protobuf v1.5.4 // indirect
	github.com/google/uuid v1.3.1 // indirect
	github.com/klauspost/compress v1.15.9 // indirect
	github.com/moby/locker v1.0.1 // indirect
	github.com/moby/sys/mountinfo v0.6.2 // indirect
	github.com/moby/sys/signal v0.6.0 // indirect
	github.com/moby/sys/user v0.1.0 // indirect
	github.com/opencontainers/selinux v1.10.1 // indirect
	github.com/pelletier/go-toml v1.9.5 // indirect
	github.com/pkg/errors v0.9.1 // indirect
	github.com/pmezard/go-difflib v1.0.0 // indirect
	go.opencensus.io v0.24.0 // indirect
	golang.org/x/net v0.23.0 // indirect
	golang.org/x/sync v0.3.0 // indirect
	golang.org/x/text v0.14.0 // indirect
	google.golang.org/genproto/googleapis/rpc v0.0.0-20231002182017-d307bd883b97 // indirect
	google.golang.org/grpc v1.59.0 // indirect
	google.golang.org/protobuf v1.33.0 // indirect
	gopkg.in/yaml.v3 v3.0.1 // indirect
)

replace (
	// use the containerd module from this repository instead of downloading
	//
	// IMPORTANT: this replace rule ONLY replaces containerd itself; dependencies
	// in the "require" section above are still taken into account for version
	// resolution if newer.
	github.com/containerd/containerd => ../../

	// Replace rules below must be kept in sync with the main go.mod file at the
	// root, because that's the actual version expected by the "containerd/containerd"
	// dependency above.
	github.com/gogo/googleapis => github.com/gogo/googleapis v1.3.2

	// urfave/cli must be <= v1.22.1 due to a regression: https://github.com/urfave/cli/issues/1092
	github.com/urfave/cli => github.com/urfave/cli v1.22.1

	google.golang.org/genproto => google.golang.org/genproto v0.0.0-20200224152610-e50cd9704f63
)
