digraph "/workplace/avs-device-sdk/AVSCommon/SDKInterfaces/test/AVSCommon/SDKInterfaces/MockMessageSender.h"
{
  edge [fontname="Helvetica",fontsize="10",labelfontname="Helvetica",labelfontsize="10"];
  node [fontname="Helvetica",fontsize="10",shape=record];
  Node1 [label="/workplace/avs-device\l-sdk/AVSCommon/SDKInterfaces\l/test/AVSCommon/SDKInterfaces\l/MockMessageSender.h",height=0.2,width=0.4,color="black", fillcolor="grey75", style="filled", fontcolor="black"];
  Node1 -> Node2 [dir="back",color="midnightblue",fontsize="10",style="solid",fontname="Helvetica"];
  Node2 [label="/workplace/avs-device\l-sdk/AVSCommon/AVS/test\l/ExceptionEncounteredSenderTest.cpp",height=0.2,width=0.4,color="black", fillcolor="white", style="filled",URL="$_exception_encountered_sender_test_8cpp.html"];
  Node1 -> Node3 [dir="back",color="midnightblue",fontsize="10",style="solid",fontname="Helvetica"];
  Node3 [label="/workplace/avs-device\l-sdk/CapabilityAgents\l/AIP/test/AudioInputProcessor\lTest.cpp",height=0.2,width=0.4,color="black", fillcolor="white", style="filled",URL="$_audio_input_processor_test_8cpp.html"];
  Node1 -> Node4 [dir="back",color="midnightblue",fontsize="10",style="solid",fontname="Helvetica"];
  Node4 [label="/workplace/avs-device\l-sdk/CapabilityAgents\l/AudioPlayer/test/AudioPlayer\lTest.cpp",height=0.2,width=0.4,color="black", fillcolor="white", style="filled",URL="$_audio_player_test_8cpp.html"];
  Node1 -> Node5 [dir="back",color="midnightblue",fontsize="10",style="solid",fontname="Helvetica"];
  Node5 [label="/workplace/avs-device\l-sdk/CapabilityAgents\l/DoNotDisturb/test/DoNotDisturb\lCapabilityAgentTest.cpp",height=0.2,width=0.4,color="black", fillcolor="white", style="filled",URL="$_do_not_disturb_capability_agent_test_8cpp.html"];
  Node1 -> Node6 [dir="back",color="midnightblue",fontsize="10",style="solid",fontname="Helvetica"];
  Node6 [label="/workplace/avs-device\l-sdk/CapabilityAgents\l/ExternalMediaPlayer/test\l/ExternalMediaPlayerTest.cpp",height=0.2,width=0.4,color="black", fillcolor="white", style="filled",URL="$_external_media_player_test_8cpp.html"];
  Node1 -> Node7 [dir="back",color="midnightblue",fontsize="10",style="solid",fontname="Helvetica"];
  Node7 [label="/workplace/avs-device\l-sdk/CapabilityAgents\l/PlaybackController/test\l/PlaybackControllerTest.cpp",height=0.2,width=0.4,color="black", fillcolor="white", style="filled",URL="$_playback_controller_test_8cpp.html"];
  Node1 -> Node8 [dir="back",color="midnightblue",fontsize="10",style="solid",fontname="Helvetica"];
  Node8 [label="/workplace/avs-device\l-sdk/CapabilityAgents\l/Settings/test/SettingsTest.cpp",height=0.2,width=0.4,color="black", fillcolor="white", style="filled",URL="$_settings_test_8cpp.html"];
  Node1 -> Node9 [dir="back",color="midnightblue",fontsize="10",style="solid",fontname="Helvetica"];
  Node9 [label="/workplace/avs-device\l-sdk/CapabilityAgents\l/SpeakerManager/test/Speaker\lManagerTest.cpp",height=0.2,width=0.4,color="black", fillcolor="white", style="filled",URL="$_speaker_manager_test_8cpp.html"];
  Node1 -> Node10 [dir="back",color="midnightblue",fontsize="10",style="solid",fontname="Helvetica"];
  Node10 [label="/workplace/avs-device\l-sdk/CapabilityAgents\l/SpeechSynthesizer/test\l/SpeechSynthesizerTest.cpp",height=0.2,width=0.4,color="black", fillcolor="white", style="filled",URL="$_speech_synthesizer_test_8cpp.html"];
  Node1 -> Node11 [dir="back",color="midnightblue",fontsize="10",style="solid",fontname="Helvetica"];
  Node11 [label="/workplace/avs-device\l-sdk/CapabilityAgents\l/System/test/SoftwareInfoTest.cpp",height=0.2,width=0.4,color="black", fillcolor="white", style="filled",URL="$_software_info_test_8cpp.html"];
  Node1 -> Node12 [dir="back",color="midnightblue",fontsize="10",style="solid",fontname="Helvetica"];
  Node12 [label="/workplace/avs-device\l-sdk/CapabilityAgents\l/System/test/UserInactivityMonitor\lTest.cpp",height=0.2,width=0.4,color="black", fillcolor="white", style="filled",URL="$_user_inactivity_monitor_test_8cpp.html"];
  Node1 -> Node13 [dir="back",color="midnightblue",fontsize="10",style="solid",fontname="Helvetica"];
  Node13 [label="/workplace/avs-device\l-sdk/CertifiedSender\l/test/CertifiedSenderTest.cpp",height=0.2,width=0.4,color="black", fillcolor="white", style="filled",URL="$_certified_sender_test_8cpp.html"];
  Node1 -> Node14 [dir="back",color="midnightblue",fontsize="10",style="solid",fontname="Helvetica"];
  Node14 [label="/workplace/avs-device\l-sdk/CertifiedSender\l/test/MockCertifiedSender.h",height=0.2,width=0.4,color="black", fillcolor="white", style="filled",URL="$_mock_certified_sender_8h.html"];
  Node14 -> Node15 [dir="back",color="midnightblue",fontsize="10",style="solid",fontname="Helvetica"];
  Node15 [label="/workplace/avs-device\l-sdk/CertifiedSender\l/test/Common/MockCertifiedSender.cpp",height=0.2,width=0.4,color="black", fillcolor="white", style="filled",URL="$_mock_certified_sender_8cpp.html"];
}
