digraph "alexaClientSDK::avsCommon::avs::attachment::Attachment"
{
  edge [fontname="Helvetica",fontsize="10",labelfontname="Helvetica",labelfontsize="10"];
  node [fontname="Helvetica",fontsize="10",shape=record];
  Node1 [label="alexaClientSDK::avsCommon\l::avs::attachment::Attachment",height=0.2,width=0.4,color="black", fillcolor="grey75", style="filled", fontcolor="black"];
  Node1 -> Node2 [dir="back",color="midnightblue",fontsize="10",style="solid",fontname="Helvetica"];
  Node2 [label="alexaClientSDK::avsCommon\l::avs::attachment::InProcessAttachment",height=0.2,width=0.4,color="black", fillcolor="white", style="filled",URL="$classalexa_client_s_d_k_1_1avs_common_1_1avs_1_1attachment_1_1_in_process_attachment.html"];
}
