digraph "/workplace/avs-device-sdk/KWD/src" {
  compound=true
  node [ fontsize="10", fontname="Helvetica"];
  edge [ labelfontsize="10", labelfontname="Helvetica"];
  subgraph clusterdir_d0ae40f34093660421d9f00fd3d110f5 {
    graph [ bgcolor="#ddddee", pencolor="black", label="KWD" fontname="Helvetica", fontsize="10", URL="dir_d0ae40f34093660421d9f00fd3d110f5.html"]
  dir_1104beda8a197feaba7f001b12a48aaa [shape=box, label="src", style="filled", fillcolor="#eeeeff", pencolor="black", URL="dir_1104beda8a197feaba7f001b12a48aaa.html"];
  }
  dir_13e65effb2bde530b17b3d5eefcd0266 [shape=box label="AVSCommon" fillcolor="white" style="filled" color="red" URL="dir_13e65effb2bde530b17b3d5eefcd0266.html"];
  dir_8dea89c1bb4f7e14d42e016f897bd2de [shape=box label="include" fillcolor="white" style="filled" color="red" URL="dir_8dea89c1bb4f7e14d42e016f897bd2de.html"];
  dir_1104beda8a197feaba7f001b12a48aaa->dir_13e65effb2bde530b17b3d5eefcd0266 [headlabel="1", labeldistance=1.5 headhref="dir_000252_000015.html"];
  dir_1104beda8a197feaba7f001b12a48aaa->dir_8dea89c1bb4f7e14d42e016f897bd2de [headlabel="1", labeldistance=1.5 headhref="dir_000252_000236.html"];
  dir_8dea89c1bb4f7e14d42e016f897bd2de->dir_13e65effb2bde530b17b3d5eefcd0266 [headlabel="4", labeldistance=1.5 headhref="dir_000236_000015.html"];
}
