digraph "Graphical Class Hierarchy"
{
  edge [fontname="Helvetica",fontsize="10",labelfontname="Helvetica",labelfontsize="10"];
  node [fontname="Helvetica",fontsize="10",shape=record];
  rankdir="LR";
  Node1 [label="alexaClientSDK::avsCommon\l::sdkInterfaces::AudioPlayerObserver\lInterface::Context",height=0.2,width=0.4,color="black", fillcolor="white", style="filled",URL="$structalexa_client_s_d_k_1_1avs_common_1_1sdk_interfaces_1_1_audio_player_observer_interface_1_1_context.html",tooltip="The context of the AudioPlayer when the observer is notified of the PlayerActivity state change..."];
}
