digraph "alexaClientSDK::avsCommon::sdkInterfaces::externalMediaPlayer::AdapterState"
{
  edge [fontname="Helvetica",fontsize="10",labelfontname="Helvetica",labelfontsize="10"];
  node [fontname="Helvetica",fontsize="10",shape=record];
  rankdir="LR";
  Node1 [label="alexaClientSDK::avsCommon\l::sdkInterfaces::externalMedia\lPlayer::AdapterState",height=0.2,width=0.4,color="black", fillcolor="grey75", style="filled", fontcolor="black"];
  Node2 -> Node1 [dir="back",color="darkorchid3",fontsize="10",style="dashed",label=" sessionState" ,fontname="Helvetica"];
  Node2 [label="alexaClientSDK::avsCommon\l::sdkInterfaces::externalMedia\lPlayer::AdapterSessionState",height=0.2,width=0.4,color="black", fillcolor="white", style="filled",URL="$structalexa_client_s_d_k_1_1avs_common_1_1sdk_interfaces_1_1external_media_player_1_1_adapter_session_state.html"];
  Node3 -> Node1 [dir="back",color="darkorchid3",fontsize="10",style="dashed",label=" playbackState" ,fontname="Helvetica"];
  Node3 [label="alexaClientSDK::avsCommon\l::sdkInterfaces::externalMedia\lPlayer::AdapterPlaybackState",height=0.2,width=0.4,color="black", fillcolor="white", style="filled",URL="$structalexa_client_s_d_k_1_1avs_common_1_1sdk_interfaces_1_1external_media_player_1_1_adapter_playback_state.html"];
}
