digraph "/workplace/avs-device-sdk/RegistrationManager/include/RegistrationManager/CustomerDataManager.h"
{
  edge [fontname="Helvetica",fontsize="10",labelfontname="Helvetica",labelfontsize="10"];
  node [fontname="Helvetica",fontsize="10",shape=record];
  Node1 [label="/workplace/avs-device\l-sdk/RegistrationManager\l/include/RegistrationManager\l/CustomerDataManager.h",height=0.2,width=0.4,color="black", fillcolor="grey75", style="filled", fontcolor="black"];
  Node1 -> Node2 [dir="back",color="midnightblue",fontsize="10",style="solid",fontname="Helvetica"];
  Node2 [label="/workplace/avs-device\l-sdk/CapabilitiesDelegate\l/include/CapabilitiesDelegate\l/CapabilitiesDelegate.h",height=0.2,width=0.4,color="black", fillcolor="white", style="filled",URL="$_capabilities_delegate_8h.html"];
  Node2 -> Node3 [dir="back",color="midnightblue",fontsize="10",style="solid",fontname="Helvetica"];
  Node3 [label="/workplace/avs-device\l-sdk/CapabilitiesDelegate\l/src/CapabilitiesDelegate.cpp",height=0.2,width=0.4,color="black", fillcolor="white", style="filled",URL="$_capabilities_delegate_8cpp.html"];
  Node2 -> Node4 [dir="back",color="midnightblue",fontsize="10",style="solid",fontname="Helvetica"];
  Node4 [label="/workplace/avs-device\l-sdk/CapabilitiesDelegate\l/test/CapabilitiesDelegateTest.cpp",height=0.2,width=0.4,color="black", fillcolor="white", style="filled",URL="$_capabilities_delegate_test_8cpp.html"];
  Node2 -> Node5 [dir="back",color="midnightblue",fontsize="10",style="solid",fontname="Helvetica"];
  Node5 [label="/workplace/avs-device\l-sdk/SampleApp/include\l/SampleApp/SampleApplication.h",height=0.2,width=0.4,color="black", fillcolor="white", style="filled",URL="$_sample_application_8h.html"];
  Node5 -> Node6 [dir="back",color="midnightblue",fontsize="10",style="solid",fontname="Helvetica"];
  Node6 [label="/workplace/avs-device\l-sdk/SampleApp/src/main.cpp",height=0.2,width=0.4,color="black", fillcolor="white", style="filled",URL="$main_8cpp.html"];
  Node5 -> Node7 [dir="back",color="midnightblue",fontsize="10",style="solid",fontname="Helvetica"];
  Node7 [label="/workplace/avs-device\l-sdk/SampleApp/src/SampleApplication.cpp",height=0.2,width=0.4,color="black", fillcolor="white", style="filled",URL="$_sample_application_8cpp.html"];
  Node2 -> Node7 [dir="back",color="midnightblue",fontsize="10",style="solid",fontname="Helvetica"];
  Node1 -> Node8 [dir="back",color="midnightblue",fontsize="10",style="solid",fontname="Helvetica"];
  Node8 [label="/workplace/avs-device\l-sdk/CapabilityAgents\l/Bluetooth/include/Bluetooth\l/Bluetooth.h",height=0.2,width=0.4,color="black", fillcolor="white", style="filled",URL="$_bluetooth_8h.html"];
  Node8 -> Node9 [dir="back",color="midnightblue",fontsize="10",style="solid",fontname="Helvetica"];
  Node9 [label="/workplace/avs-device\l-sdk/ApplicationUtilities\l/DefaultClient/include/DefaultClient\l/DefaultClient.h",height=0.2,width=0.4,color="black", fillcolor="white", style="filled",URL="$_default_client_8h.html"];
  Node9 -> Node10 [dir="back",color="midnightblue",fontsize="10",style="solid",fontname="Helvetica"];
  Node10 [label="/workplace/avs-device\l-sdk/ApplicationUtilities\l/DefaultClient/src/DefaultClient.cpp",height=0.2,width=0.4,color="black", fillcolor="white", style="filled",URL="$_default_client_8cpp.html"];
  Node9 -> Node11 [dir="back",color="midnightblue",fontsize="10",style="solid",fontname="Helvetica"];
  Node11 [label="/workplace/avs-device\l-sdk/SampleApp/include\l/SampleApp/InteractionManager.h",height=0.2,width=0.4,color="black", fillcolor="white", style="filled",URL="$_interaction_manager_8h.html"];
  Node11 -> Node12 [dir="back",color="midnightblue",fontsize="10",style="solid",fontname="Helvetica"];
  Node12 [label="/workplace/avs-device\l-sdk/SampleApp/include\l/SampleApp/UserInputManager.h",height=0.2,width=0.4,color="red", fillcolor="white", style="filled",URL="$_user_input_manager_8h.html"];
  Node12 -> Node5 [dir="back",color="midnightblue",fontsize="10",style="solid",fontname="Helvetica"];
  Node11 -> Node13 [dir="back",color="midnightblue",fontsize="10",style="solid",fontname="Helvetica"];
  Node13 [label="/workplace/avs-device\l-sdk/SampleApp/src/Interaction\lManager.cpp",height=0.2,width=0.4,color="black", fillcolor="white", style="filled",URL="$_interaction_manager_8cpp.html"];
  Node9 -> Node14 [dir="back",color="midnightblue",fontsize="10",style="solid",fontname="Helvetica"];
  Node14 [label="/workplace/avs-device\l-sdk/SampleApp/include\l/SampleApp/KeywordObserver.h",height=0.2,width=0.4,color="red", fillcolor="white", style="filled",URL="$_keyword_observer_8h.html"];
  Node14 -> Node11 [dir="back",color="midnightblue",fontsize="10",style="solid",fontname="Helvetica"];
  Node14 -> Node7 [dir="back",color="midnightblue",fontsize="10",style="solid",fontname="Helvetica"];
  Node8 -> Node15 [dir="back",color="midnightblue",fontsize="10",style="solid",fontname="Helvetica"];
  Node15 [label="/workplace/avs-device\l-sdk/CapabilityAgents\l/Bluetooth/src/Bluetooth.cpp",height=0.2,width=0.4,color="black", fillcolor="white", style="filled",URL="$_bluetooth_8cpp.html"];
  Node1 -> Node16 [dir="back",color="midnightblue",fontsize="10",style="solid",fontname="Helvetica"];
  Node16 [label="/workplace/avs-device\l-sdk/CapabilityAgents\l/DoNotDisturb/include\l/DoNotDisturbCA/DoNotDisturbCapability\lAgent.h",height=0.2,width=0.4,color="black", fillcolor="white", style="filled",URL="$_do_not_disturb_capability_agent_8h.html"];
  Node16 -> Node9 [dir="back",color="midnightblue",fontsize="10",style="solid",fontname="Helvetica"];
  Node16 -> Node17 [dir="back",color="midnightblue",fontsize="10",style="solid",fontname="Helvetica"];
  Node17 [label="/workplace/avs-device\l-sdk/CapabilityAgents\l/DoNotDisturb/src/DoNotDisturb\lCapabilityAgent.cpp",height=0.2,width=0.4,color="black", fillcolor="white", style="filled",URL="$_do_not_disturb_capability_agent_8cpp.html"];
  Node16 -> Node18 [dir="back",color="midnightblue",fontsize="10",style="solid",fontname="Helvetica"];
  Node18 [label="/workplace/avs-device\l-sdk/CapabilityAgents\l/DoNotDisturb/test/DoNotDisturb\lCapabilityAgentTest.cpp",height=0.2,width=0.4,color="black", fillcolor="white", style="filled",URL="$_do_not_disturb_capability_agent_test_8cpp.html"];
  Node1 -> Node18 [dir="back",color="midnightblue",fontsize="10",style="solid",fontname="Helvetica"];
  Node1 -> Node19 [dir="back",color="midnightblue",fontsize="10",style="solid",fontname="Helvetica"];
  Node19 [label="/workplace/avs-device\l-sdk/CapabilityAgents\l/Equalizer/include/Equalizer\l/EqualizerCapabilityAgent.h",height=0.2,width=0.4,color="black", fillcolor="white", style="filled",URL="$_equalizer_capability_agent_8h.html"];
  Node19 -> Node9 [dir="back",color="midnightblue",fontsize="10",style="solid",fontname="Helvetica"];
  Node19 -> Node20 [dir="back",color="midnightblue",fontsize="10",style="solid",fontname="Helvetica"];
  Node20 [label="/workplace/avs-device\l-sdk/CapabilityAgents\l/Equalizer/src/EqualizerCapability\lAgent.cpp",height=0.2,width=0.4,color="black", fillcolor="white", style="filled",URL="$_equalizer_capability_agent_8cpp.html"];
  Node1 -> Node21 [dir="back",color="midnightblue",fontsize="10",style="solid",fontname="Helvetica"];
  Node21 [label="/workplace/avs-device\l-sdk/CapabilityAgents\l/Notifications/test/Notifications\lCapabilityAgentTest.cpp",height=0.2,width=0.4,color="black", fillcolor="white", style="filled",URL="$_notifications_capability_agent_test_8cpp.html"];
  Node1 -> Node22 [dir="back",color="midnightblue",fontsize="10",style="solid",fontname="Helvetica"];
  Node22 [label="/workplace/avs-device\l-sdk/CapabilityAgents\l/Settings/include/Settings\l/Settings.h",height=0.2,width=0.4,color="black", fillcolor="white", style="filled",URL="$_settings_8h.html"];
  Node22 -> Node9 [dir="back",color="midnightblue",fontsize="10",style="solid",fontname="Helvetica"];
  Node22 -> Node23 [dir="back",color="midnightblue",fontsize="10",style="solid",fontname="Helvetica"];
  Node23 [label="/workplace/avs-device\l-sdk/CapabilityAgents\l/Settings/src/Settings.cpp",height=0.2,width=0.4,color="black", fillcolor="white", style="filled",URL="$_settings_8cpp.html"];
  Node22 -> Node24 [dir="back",color="midnightblue",fontsize="10",style="solid",fontname="Helvetica"];
  Node24 [label="/workplace/avs-device\l-sdk/CapabilityAgents\l/Settings/test/SettingsTest.cpp",height=0.2,width=0.4,color="black", fillcolor="white", style="filled",URL="$_settings_test_8cpp.html"];
  Node1 -> Node25 [dir="back",color="midnightblue",fontsize="10",style="solid",fontname="Helvetica"];
  Node25 [label="/workplace/avs-device\l-sdk/CertifiedSender\l/include/CertifiedSender\l/CertifiedSender.h",height=0.2,width=0.4,color="black", fillcolor="white", style="filled",URL="$_certified_sender_8h.html"];
  Node25 -> Node9 [dir="back",color="midnightblue",fontsize="10",style="solid",fontname="Helvetica"];
  Node25 -> Node26 [dir="back",color="midnightblue",fontsize="10",style="solid",fontname="Helvetica"];
  Node26 [label="/workplace/avs-device\l-sdk/CapabilityAgents\l/Alerts/include/Alerts\l/AlertsCapabilityAgent.h",height=0.2,width=0.4,color="red", fillcolor="white", style="filled",URL="$_alerts_capability_agent_8h.html"];
  Node26 -> Node9 [dir="back",color="midnightblue",fontsize="10",style="solid",fontname="Helvetica"];
  Node26 -> Node27 [dir="back",color="midnightblue",fontsize="10",style="solid",fontname="Helvetica"];
  Node27 [label="/workplace/avs-device\l-sdk/Integration/test\l/AlertsIntegrationTest.cpp",height=0.2,width=0.4,color="black", fillcolor="white", style="filled",URL="$_alerts_integration_test_8cpp.html"];
  Node25 -> Node28 [dir="back",color="midnightblue",fontsize="10",style="solid",fontname="Helvetica"];
  Node28 [label="/workplace/avs-device\l-sdk/CapabilityAgents\l/Settings/include/Settings\l/SettingsUpdatedEventSender.h",height=0.2,width=0.4,color="red", fillcolor="white", style="filled",URL="$_settings_updated_event_sender_8h.html"];
  Node28 -> Node9 [dir="back",color="midnightblue",fontsize="10",style="solid",fontname="Helvetica"];
  Node28 -> Node10 [dir="back",color="midnightblue",fontsize="10",style="solid",fontname="Helvetica"];
  Node28 -> Node24 [dir="back",color="midnightblue",fontsize="10",style="solid",fontname="Helvetica"];
  Node25 -> Node24 [dir="back",color="midnightblue",fontsize="10",style="solid",fontname="Helvetica"];
  Node25 -> Node29 [dir="back",color="midnightblue",fontsize="10",style="solid",fontname="Helvetica"];
  Node29 [label="/workplace/avs-device\l-sdk/CertifiedSender\l/src/CertifiedSender.cpp",height=0.2,width=0.4,color="black", fillcolor="white", style="filled",URL="$_certified_sender_8cpp.html"];
  Node25 -> Node30 [dir="back",color="midnightblue",fontsize="10",style="solid",fontname="Helvetica"];
  Node30 [label="/workplace/avs-device\l-sdk/CertifiedSender\l/test/CertifiedSenderTest.cpp",height=0.2,width=0.4,color="black", fillcolor="white", style="filled",URL="$_certified_sender_test_8cpp.html"];
  Node25 -> Node31 [dir="back",color="midnightblue",fontsize="10",style="solid",fontname="Helvetica"];
  Node31 [label="/workplace/avs-device\l-sdk/CertifiedSender\l/test/MockCertifiedSender.h",height=0.2,width=0.4,color="red", fillcolor="white", style="filled",URL="$_mock_certified_sender_8h.html"];
  Node25 -> Node27 [dir="back",color="midnightblue",fontsize="10",style="solid",fontname="Helvetica"];
  Node1 -> Node29 [dir="back",color="midnightblue",fontsize="10",style="solid",fontname="Helvetica"];
  Node1 -> Node30 [dir="back",color="midnightblue",fontsize="10",style="solid",fontname="Helvetica"];
  Node1 -> Node32 [dir="back",color="midnightblue",fontsize="10",style="solid",fontname="Helvetica"];
  Node32 [label="/workplace/avs-device\l-sdk/Integration/include\l/Integration/ACLTestContext.h",height=0.2,width=0.4,color="black", fillcolor="white", style="filled",URL="$_a_c_l_test_context_8h.html"];
  Node32 -> Node33 [dir="back",color="midnightblue",fontsize="10",style="solid",fontname="Helvetica"];
  Node33 [label="/workplace/avs-device\l-sdk/Integration/src\l/ACLTestContext.cpp",height=0.2,width=0.4,color="black", fillcolor="white", style="filled",URL="$_a_c_l_test_context_8cpp.html"];
  Node32 -> Node27 [dir="back",color="midnightblue",fontsize="10",style="solid",fontname="Helvetica"];
  Node32 -> Node34 [dir="back",color="midnightblue",fontsize="10",style="solid",fontname="Helvetica"];
  Node34 [label="/workplace/avs-device\l-sdk/Integration/test\l/AlexaCommunicationsLibraryTest.cpp",height=0.2,width=0.4,color="black", fillcolor="white", style="filled",URL="$_alexa_communications_library_test_8cpp.html"];
  Node32 -> Node35 [dir="back",color="midnightblue",fontsize="10",style="solid",fontname="Helvetica"];
  Node35 [label="/workplace/avs-device\l-sdk/Integration/test\l/AlexaDirectiveSequencerLibrary\lTest.cpp",height=0.2,width=0.4,color="black", fillcolor="white", style="filled",URL="$_alexa_directive_sequencer_library_test_8cpp.html"];
  Node32 -> Node36 [dir="back",color="midnightblue",fontsize="10",style="solid",fontname="Helvetica"];
  Node36 [label="/workplace/avs-device\l-sdk/Integration/test\l/AudioInputProcessorIntegration\lTest.cpp",height=0.2,width=0.4,color="black", fillcolor="white", style="filled",URL="$_audio_input_processor_integration_test_8cpp.html"];
  Node32 -> Node37 [dir="back",color="midnightblue",fontsize="10",style="solid",fontname="Helvetica"];
  Node37 [label="/workplace/avs-device\l-sdk/Integration/test\l/AudioPlayerIntegrationTest.cpp",height=0.2,width=0.4,color="black", fillcolor="white", style="filled",URL="$_audio_player_integration_test_8cpp.html"];
  Node32 -> Node38 [dir="back",color="midnightblue",fontsize="10",style="solid",fontname="Helvetica"];
  Node38 [label="/workplace/avs-device\l-sdk/Integration/test\l/NetworkIntegrationTests.cpp",height=0.2,width=0.4,color="black", fillcolor="white", style="filled",URL="$_network_integration_tests_8cpp.html"];
  Node32 -> Node39 [dir="back",color="midnightblue",fontsize="10",style="solid",fontname="Helvetica"];
  Node39 [label="/workplace/avs-device\l-sdk/Integration/test\l/SpeechSynthesizerIntegration\lTest.cpp",height=0.2,width=0.4,color="black", fillcolor="white", style="filled",URL="$_speech_synthesizer_integration_test_8cpp.html"];
  Node1 -> Node40 [dir="back",color="midnightblue",fontsize="10",style="solid",fontname="Helvetica"];
  Node40 [label="/workplace/avs-device\l-sdk/Integration/include\l/Integration/AuthDelegateTestContext.h",height=0.2,width=0.4,color="black", fillcolor="white", style="filled",URL="$_auth_delegate_test_context_8h.html"];
  Node40 -> Node32 [dir="back",color="midnightblue",fontsize="10",style="solid",fontname="Helvetica"];
  Node40 -> Node41 [dir="back",color="midnightblue",fontsize="10",style="solid",fontname="Helvetica"];
  Node41 [label="/workplace/avs-device\l-sdk/Integration/src\l/AuthDelegateTestContext.cpp",height=0.2,width=0.4,color="black", fillcolor="white", style="filled",URL="$_auth_delegate_test_context_8cpp.html"];
  Node40 -> Node42 [dir="back",color="midnightblue",fontsize="10",style="solid",fontname="Helvetica"];
  Node42 [label="/workplace/avs-device\l-sdk/Integration/test\l/AlexaAuthorizationDelegateTest.cpp",height=0.2,width=0.4,color="black", fillcolor="white", style="filled",URL="$_alexa_authorization_delegate_test_8cpp.html"];
  Node40 -> Node43 [dir="back",color="midnightblue",fontsize="10",style="solid",fontname="Helvetica"];
  Node43 [label="/workplace/avs-device\l-sdk/Integration/test\l/ServerDisconnectIntegration\lTest.cpp",height=0.2,width=0.4,color="black", fillcolor="white", style="filled",URL="$_server_disconnect_integration_test_8cpp.html"];
  Node1 -> Node42 [dir="back",color="midnightblue",fontsize="10",style="solid",fontname="Helvetica"];
  Node1 -> Node44 [dir="back",color="midnightblue",fontsize="10",style="solid",fontname="Helvetica"];
  Node44 [label="/workplace/avs-device\l-sdk/RegistrationManager\l/include/RegistrationManager\l/RegistrationManager.h",height=0.2,width=0.4,color="black", fillcolor="white", style="filled",URL="$_registration_manager_8h.html"];
  Node44 -> Node9 [dir="back",color="midnightblue",fontsize="10",style="solid",fontname="Helvetica"];
  Node44 -> Node45 [dir="back",color="midnightblue",fontsize="10",style="solid",fontname="Helvetica"];
  Node45 [label="/workplace/avs-device\l-sdk/RegistrationManager\l/src/RegistrationManager.cpp",height=0.2,width=0.4,color="black", fillcolor="white", style="filled",URL="$_registration_manager_8cpp.html"];
  Node44 -> Node46 [dir="back",color="midnightblue",fontsize="10",style="solid",fontname="Helvetica"];
  Node46 [label="/workplace/avs-device\l-sdk/RegistrationManager\l/test/RegistrationManagerTest.cpp",height=0.2,width=0.4,color="black", fillcolor="white", style="filled",URL="$_registration_manager_test_8cpp.html"];
  Node44 -> Node47 [dir="back",color="midnightblue",fontsize="10",style="solid",fontname="Helvetica"];
  Node47 [label="/workplace/avs-device\l-sdk/SampleApp/include\l/SampleApp/RevokeAuthorization\lObserver.h",height=0.2,width=0.4,color="red", fillcolor="white", style="filled",URL="$_revoke_authorization_observer_8h.html"];
  Node1 -> Node48 [dir="back",color="midnightblue",fontsize="10",style="solid",fontname="Helvetica"];
  Node48 [label="/workplace/avs-device\l-sdk/RegistrationManager\l/src/CustomerDataHandler.cpp",height=0.2,width=0.4,color="black", fillcolor="white", style="filled",URL="$_customer_data_handler_8cpp.html"];
  Node1 -> Node49 [dir="back",color="midnightblue",fontsize="10",style="solid",fontname="Helvetica"];
  Node49 [label="/workplace/avs-device\l-sdk/RegistrationManager\l/src/CustomerDataManager.cpp",height=0.2,width=0.4,color="black", fillcolor="white", style="filled",URL="$_customer_data_manager_8cpp.html"];
  Node1 -> Node45 [dir="back",color="midnightblue",fontsize="10",style="solid",fontname="Helvetica"];
  Node1 -> Node50 [dir="back",color="midnightblue",fontsize="10",style="solid",fontname="Helvetica"];
  Node50 [label="/workplace/avs-device\l-sdk/RegistrationManager\l/test/CustomerDataManagerTest.cpp",height=0.2,width=0.4,color="black", fillcolor="white", style="filled",URL="$_customer_data_manager_test_8cpp.html"];
  Node1 -> Node46 [dir="back",color="midnightblue",fontsize="10",style="solid",fontname="Helvetica"];
  Node1 -> Node11 [dir="back",color="midnightblue",fontsize="10",style="solid",fontname="Helvetica"];
  Node1 -> Node13 [dir="back",color="midnightblue",fontsize="10",style="solid",fontname="Helvetica"];
}
