digraph "Graphical Class Hierarchy"
{
  edge [fontname="Helvetica",fontsize="10",labelfontname="Helvetica",labelfontsize="10"];
  node [fontname="Helvetica",fontsize="10",shape=record];
  rankdir="LR";
  Node1 [label="alexaClientSDK::avsCommon\l::sdkInterfaces::audio\l::EqualizerState",height=0.2,width=0.4,color="black", fillcolor="white", style="filled",URL="$structalexa_client_s_d_k_1_1avs_common_1_1sdk_interfaces_1_1audio_1_1_equalizer_state.html"];
}
