digraph "/workplace/avs-device-sdk/EqualizerImplementations/include/EqualizerImplementations/EqualizerUtils.h"
{
  edge [fontname="Helvetica",fontsize="10",labelfontname="Helvetica",labelfontsize="10"];
  node [fontname="Helvetica",fontsize="10",shape=record];
  Node1 [label="/workplace/avs-device\l-sdk/EqualizerImplementations\l/include/EqualizerImplementations\l/EqualizerUtils.h",height=0.2,width=0.4,color="black", fillcolor="grey75", style="filled", fontcolor="black"];
  Node1 -> Node2 [dir="back",color="midnightblue",fontsize="10",style="solid",fontname="Helvetica"];
  Node2 [label="/workplace/avs-device\l-sdk/EqualizerImplementations\l/src/EqualizerUtils.cpp",height=0.2,width=0.4,color="black", fillcolor="white", style="filled",URL="$_equalizer_utils_8cpp.html"];
  Node1 -> Node3 [dir="back",color="midnightblue",fontsize="10",style="solid",fontname="Helvetica"];
  Node3 [label="/workplace/avs-device\l-sdk/EqualizerImplementations\l/src/MiscDBEqualizerStorage.cpp",height=0.2,width=0.4,color="black", fillcolor="white", style="filled",URL="$_misc_d_b_equalizer_storage_8cpp.html"];
}
