digraph "/workplace/avs-device-sdk/ACL/src/Transport/MessageRouter.cpp"
{
  edge [fontname="Helvetica",fontsize="10",labelfontname="Helvetica",labelfontsize="10"];
  node [fontname="Helvetica",fontsize="10",shape=record];
  Node1 [label="/workplace/avs-device\l-sdk/ACL/src/Transport\l/MessageRouter.cpp",height=0.2,width=0.4,color="black", fillcolor="grey75", style="filled", fontcolor="black"];
  Node1 -> Node2 [color="midnightblue",fontsize="10",style="solid",fontname="Helvetica"];
  Node2 [label="algorithm",height=0.2,width=0.4,color="grey75", fillcolor="white", style="filled"];
  Node1 -> Node3 [color="midnightblue",fontsize="10",style="solid",fontname="Helvetica"];
  Node3 [label="curl/curl.h",height=0.2,width=0.4,color="grey75", fillcolor="white", style="filled"];
  Node1 -> Node4 [color="midnightblue",fontsize="10",style="solid",fontname="Helvetica"];
  Node4 [label="AVSCommon/Utils/Logger\l/Logger.h",height=0.2,width=0.4,color="black", fillcolor="white", style="filled",URL="$_logger_8h.html"];
  Node4 -> Node5 [color="midnightblue",fontsize="10",style="solid",fontname="Helvetica"];
  Node5 [label="atomic",height=0.2,width=0.4,color="grey75", fillcolor="white", style="filled"];
  Node4 -> Node6 [color="midnightblue",fontsize="10",style="solid",fontname="Helvetica"];
  Node6 [label="chrono",height=0.2,width=0.4,color="grey75", fillcolor="white", style="filled"];
  Node4 -> Node7 [color="midnightblue",fontsize="10",style="solid",fontname="Helvetica"];
  Node7 [label="mutex",height=0.2,width=0.4,color="grey75", fillcolor="white", style="filled"];
  Node4 -> Node8 [color="midnightblue",fontsize="10",style="solid",fontname="Helvetica"];
  Node8 [label="sstream",height=0.2,width=0.4,color="grey75", fillcolor="white", style="filled"];
  Node4 -> Node9 [color="midnightblue",fontsize="10",style="solid",fontname="Helvetica"];
  Node9 [label="vector",height=0.2,width=0.4,color="grey75", fillcolor="white", style="filled"];
  Node4 -> Node10 [color="midnightblue",fontsize="10",style="solid",fontname="Helvetica"];
  Node10 [label="AVSCommon/Utils/Configuration\l/ConfigurationNode.h",height=0.2,width=0.4,color="black", fillcolor="white", style="filled",URL="$_configuration_node_8h.html"];
  Node10 -> Node6 [color="midnightblue",fontsize="10",style="solid",fontname="Helvetica"];
  Node10 -> Node11 [color="midnightblue",fontsize="10",style="solid",fontname="Helvetica"];
  Node11 [label="iostream",height=0.2,width=0.4,color="grey75", fillcolor="white", style="filled"];
  Node10 -> Node12 [color="midnightblue",fontsize="10",style="solid",fontname="Helvetica"];
  Node12 [label="memory",height=0.2,width=0.4,color="grey75", fillcolor="white", style="filled"];
  Node10 -> Node7 [color="midnightblue",fontsize="10",style="solid",fontname="Helvetica"];
  Node10 -> Node13 [color="midnightblue",fontsize="10",style="solid",fontname="Helvetica"];
  Node13 [label="string",height=0.2,width=0.4,color="grey75", fillcolor="white", style="filled"];
  Node10 -> Node9 [color="midnightblue",fontsize="10",style="solid",fontname="Helvetica"];
  Node10 -> Node14 [color="midnightblue",fontsize="10",style="solid",fontname="Helvetica"];
  Node14 [label="rapidjson/document.h",height=0.2,width=0.4,color="grey75", fillcolor="white", style="filled"];
  Node4 -> Node15 [color="midnightblue",fontsize="10",style="solid",fontname="Helvetica"];
  Node15 [label="AVSCommon/Utils/Logger\l/Level.h",height=0.2,width=0.4,color="black", fillcolor="white", style="filled",URL="$_level_8h.html"];
  Node15 -> Node13 [color="midnightblue",fontsize="10",style="solid",fontname="Helvetica"];
  Node4 -> Node16 [color="midnightblue",fontsize="10",style="solid",fontname="Helvetica"];
  Node16 [label="AVSCommon/Utils/Logger\l/LogEntry.h",height=0.2,width=0.4,color="black", fillcolor="white", style="filled",URL="$_log_entry_8h.html"];
  Node16 -> Node8 [color="midnightblue",fontsize="10",style="solid",fontname="Helvetica"];
  Node16 -> Node13 [color="midnightblue",fontsize="10",style="solid",fontname="Helvetica"];
  Node16 -> Node17 [color="midnightblue",fontsize="10",style="solid",fontname="Helvetica"];
  Node17 [label="AVSCommon/Utils/Logger\l/LogEntryStream.h",height=0.2,width=0.4,color="black", fillcolor="white", style="filled",URL="$_log_entry_stream_8h.html"];
  Node17 -> Node18 [color="midnightblue",fontsize="10",style="solid",fontname="Helvetica"];
  Node18 [label="ostream",height=0.2,width=0.4,color="grey75", fillcolor="white", style="filled"];
  Node17 -> Node19 [color="midnightblue",fontsize="10",style="solid",fontname="Helvetica"];
  Node19 [label="AVSCommon/Utils/Logger\l/LogEntryBuffer.h",height=0.2,width=0.4,color="red", fillcolor="white", style="filled",URL="$_log_entry_buffer_8h.html"];
  Node19 -> Node12 [color="midnightblue",fontsize="10",style="solid",fontname="Helvetica"];
  Node19 -> Node9 [color="midnightblue",fontsize="10",style="solid",fontname="Helvetica"];
  Node4 -> Node20 [color="midnightblue",fontsize="10",style="solid",fontname="Helvetica"];
  Node20 [label="AVSCommon/Utils/Logger\l/LogLevelObserverInterface.h",height=0.2,width=0.4,color="black", fillcolor="white", style="filled",URL="$_log_level_observer_interface_8h.html"];
  Node20 -> Node15 [color="midnightblue",fontsize="10",style="solid",fontname="Helvetica"];
  Node4 -> Node21 [color="midnightblue",fontsize="10",style="solid",fontname="Helvetica"];
  Node21 [label="AVSCommon/Utils/Logger\l/SinkObserverInterface.h",height=0.2,width=0.4,color="black", fillcolor="white", style="filled",URL="$_sink_observer_interface_8h.html"];
  Node21 -> Node12 [color="midnightblue",fontsize="10",style="solid",fontname="Helvetica"];
  Node1 -> Node22 [color="midnightblue",fontsize="10",style="solid",fontname="Helvetica"];
  Node22 [label="AVSCommon/Utils/Memory\l/Memory.h",height=0.2,width=0.4,color="black", fillcolor="white", style="filled",URL="$_memory_8h.html"];
  Node22 -> Node12 [color="midnightblue",fontsize="10",style="solid",fontname="Helvetica"];
  Node22 -> Node23 [color="midnightblue",fontsize="10",style="solid",fontname="Helvetica"];
  Node23 [label="utility",height=0.2,width=0.4,color="grey75", fillcolor="white", style="filled"];
  Node1 -> Node24 [color="midnightblue",fontsize="10",style="solid",fontname="Helvetica"];
  Node24 [label="AVSCommon/Utils/Threading\l/Executor.h",height=0.2,width=0.4,color="black", fillcolor="white", style="filled",URL="$_executor_8h.html"];
  Node24 -> Node5 [color="midnightblue",fontsize="10",style="solid",fontname="Helvetica"];
  Node24 -> Node25 [color="midnightblue",fontsize="10",style="solid",fontname="Helvetica"];
  Node25 [label="condition_variable",height=0.2,width=0.4,color="grey75", fillcolor="white", style="filled"];
  Node24 -> Node6 [color="midnightblue",fontsize="10",style="solid",fontname="Helvetica"];
  Node24 -> Node26 [color="midnightblue",fontsize="10",style="solid",fontname="Helvetica"];
  Node26 [label="deque",height=0.2,width=0.4,color="grey75", fillcolor="white", style="filled"];
  Node24 -> Node27 [color="midnightblue",fontsize="10",style="solid",fontname="Helvetica"];
  Node27 [label="functional",height=0.2,width=0.4,color="grey75", fillcolor="white", style="filled"];
  Node24 -> Node28 [color="midnightblue",fontsize="10",style="solid",fontname="Helvetica"];
  Node28 [label="future",height=0.2,width=0.4,color="grey75", fillcolor="white", style="filled"];
  Node24 -> Node12 [color="midnightblue",fontsize="10",style="solid",fontname="Helvetica"];
  Node24 -> Node7 [color="midnightblue",fontsize="10",style="solid",fontname="Helvetica"];
  Node24 -> Node23 [color="midnightblue",fontsize="10",style="solid",fontname="Helvetica"];
  Node24 -> Node29 [color="midnightblue",fontsize="10",style="solid",fontname="Helvetica"];
  Node29 [label="AVSCommon/Utils/Threading\l/TaskThread.h",height=0.2,width=0.4,color="black", fillcolor="white", style="filled",URL="$_task_thread_8h.html"];
  Node29 -> Node5 [color="midnightblue",fontsize="10",style="solid",fontname="Helvetica"];
  Node29 -> Node27 [color="midnightblue",fontsize="10",style="solid",fontname="Helvetica"];
  Node29 -> Node13 [color="midnightblue",fontsize="10",style="solid",fontname="Helvetica"];
  Node29 -> Node30 [color="midnightblue",fontsize="10",style="solid",fontname="Helvetica"];
  Node30 [label="thread",height=0.2,width=0.4,color="grey75", fillcolor="white", style="filled"];
  Node1 -> Node31 [color="midnightblue",fontsize="10",style="solid",fontname="Helvetica"];
  Node31 [label="ACL/Transport/MessageRouter.h",height=0.2,width=0.4,color="black", fillcolor="white", style="filled",URL="$_message_router_8h.html"];
  Node31 -> Node12 [color="midnightblue",fontsize="10",style="solid",fontname="Helvetica"];
  Node31 -> Node7 [color="midnightblue",fontsize="10",style="solid",fontname="Helvetica"];
  Node31 -> Node13 [color="midnightblue",fontsize="10",style="solid",fontname="Helvetica"];
  Node31 -> Node9 [color="midnightblue",fontsize="10",style="solid",fontname="Helvetica"];
  Node31 -> Node24 [color="midnightblue",fontsize="10",style="solid",fontname="Helvetica"];
  Node31 -> Node32 [color="midnightblue",fontsize="10",style="solid",fontname="Helvetica"];
  Node32 [label="AVSCommon/AVS/Attachment\l/AttachmentManager.h",height=0.2,width=0.4,color="black", fillcolor="white", style="filled",URL="$_attachment_manager_8h.html"];
  Node32 -> Node7 [color="midnightblue",fontsize="10",style="solid",fontname="Helvetica"];
  Node32 -> Node33 [color="midnightblue",fontsize="10",style="solid",fontname="Helvetica"];
  Node33 [label="unordered_map",height=0.2,width=0.4,color="grey75", fillcolor="white", style="filled"];
  Node32 -> Node34 [color="midnightblue",fontsize="10",style="solid",fontname="Helvetica"];
  Node34 [label="AVSCommon/AVS/Attachment\l/AttachmentManagerInterface.h",height=0.2,width=0.4,color="red", fillcolor="white", style="filled",URL="$_attachment_manager_interface_8h.html"];
  Node34 -> Node6 [color="midnightblue",fontsize="10",style="solid",fontname="Helvetica"];
  Node34 -> Node13 [color="midnightblue",fontsize="10",style="solid",fontname="Helvetica"];
  Node34 -> Node12 [color="midnightblue",fontsize="10",style="solid",fontname="Helvetica"];
  Node34 -> Node35 [color="midnightblue",fontsize="10",style="solid",fontname="Helvetica"];
  Node35 [label="AVSCommon/AVS/Attachment\l/AttachmentReader.h",height=0.2,width=0.4,color="red", fillcolor="white", style="filled",URL="$_attachment_reader_8h.html"];
  Node35 -> Node6 [color="midnightblue",fontsize="10",style="solid",fontname="Helvetica"];
  Node35 -> Node18 [color="midnightblue",fontsize="10",style="solid",fontname="Helvetica"];
  Node31 -> Node36 [color="midnightblue",fontsize="10",style="solid",fontname="Helvetica"];
  Node36 [label="AVSCommon/AVS/MessageRequest.h",height=0.2,width=0.4,color="black", fillcolor="white", style="filled",URL="$_message_request_8h.html"];
  Node36 -> Node37 [color="midnightblue",fontsize="10",style="solid",fontname="Helvetica"];
  Node37 [label="cstdlib",height=0.2,width=0.4,color="grey75", fillcolor="white", style="filled"];
  Node36 -> Node12 [color="midnightblue",fontsize="10",style="solid",fontname="Helvetica"];
  Node36 -> Node7 [color="midnightblue",fontsize="10",style="solid",fontname="Helvetica"];
  Node36 -> Node13 [color="midnightblue",fontsize="10",style="solid",fontname="Helvetica"];
  Node36 -> Node38 [color="midnightblue",fontsize="10",style="solid",fontname="Helvetica"];
  Node38 [label="unordered_set",height=0.2,width=0.4,color="grey75", fillcolor="white", style="filled"];
  Node36 -> Node9 [color="midnightblue",fontsize="10",style="solid",fontname="Helvetica"];
  Node36 -> Node35 [color="midnightblue",fontsize="10",style="solid",fontname="Helvetica"];
  Node36 -> Node39 [color="midnightblue",fontsize="10",style="solid",fontname="Helvetica"];
  Node39 [label="AVSCommon/SDKInterfaces\l/MessageRequestObserverInterface.h",height=0.2,width=0.4,color="black", fillcolor="white", style="filled",URL="$_message_request_observer_interface_8h.html"];
  Node39 -> Node11 [color="midnightblue",fontsize="10",style="solid",fontname="Helvetica"];
  Node31 -> Node40 [color="midnightblue",fontsize="10",style="solid",fontname="Helvetica"];
  Node40 [label="AVSCommon/SDKInterfaces\l/AuthDelegateInterface.h",height=0.2,width=0.4,color="black", fillcolor="white", style="filled",URL="$_auth_delegate_interface_8h.html"];
  Node40 -> Node12 [color="midnightblue",fontsize="10",style="solid",fontname="Helvetica"];
  Node40 -> Node13 [color="midnightblue",fontsize="10",style="solid",fontname="Helvetica"];
  Node40 -> Node41 [color="midnightblue",fontsize="10",style="solid",fontname="Helvetica"];
  Node41 [label="AVSCommon/SDKInterfaces\l/AuthObserverInterface.h",height=0.2,width=0.4,color="black", fillcolor="white", style="filled",URL="$_auth_observer_interface_8h.html"];
  Node41 -> Node18 [color="midnightblue",fontsize="10",style="solid",fontname="Helvetica"];
  Node31 -> Node42 [color="midnightblue",fontsize="10",style="solid",fontname="Helvetica"];
  Node42 [label="ACL/Transport/MessageConsumer\lInterface.h",height=0.2,width=0.4,color="black", fillcolor="white", style="filled",URL="$_message_consumer_interface_8h.html"];
  Node42 -> Node12 [color="midnightblue",fontsize="10",style="solid",fontname="Helvetica"];
  Node31 -> Node43 [color="midnightblue",fontsize="10",style="solid",fontname="Helvetica"];
  Node43 [label="ACL/Transport/MessageRouter\lInterface.h",height=0.2,width=0.4,color="black", fillcolor="white", style="filled",URL="$_message_router_interface_8h.html"];
  Node43 -> Node12 [color="midnightblue",fontsize="10",style="solid",fontname="Helvetica"];
  Node43 -> Node13 [color="midnightblue",fontsize="10",style="solid",fontname="Helvetica"];
  Node43 -> Node23 [color="midnightblue",fontsize="10",style="solid",fontname="Helvetica"];
  Node43 -> Node24 [color="midnightblue",fontsize="10",style="solid",fontname="Helvetica"];
  Node43 -> Node44 [color="midnightblue",fontsize="10",style="solid",fontname="Helvetica"];
  Node44 [label="AVSCommon/Utils/Requires\lShutdown.h",height=0.2,width=0.4,color="black", fillcolor="white", style="filled",URL="$_requires_shutdown_8h.html"];
  Node44 -> Node5 [color="midnightblue",fontsize="10",style="solid",fontname="Helvetica"];
  Node44 -> Node12 [color="midnightblue",fontsize="10",style="solid",fontname="Helvetica"];
  Node44 -> Node7 [color="midnightblue",fontsize="10",style="solid",fontname="Helvetica"];
  Node44 -> Node13 [color="midnightblue",fontsize="10",style="solid",fontname="Helvetica"];
  Node43 -> Node36 [color="midnightblue",fontsize="10",style="solid",fontname="Helvetica"];
  Node43 -> Node45 [color="midnightblue",fontsize="10",style="solid",fontname="Helvetica"];
  Node45 [label="AVSCommon/SDKInterfaces\l/MessageSenderInterface.h",height=0.2,width=0.4,color="black", fillcolor="white", style="filled",URL="$_message_sender_interface_8h.html"];
  Node45 -> Node36 [color="midnightblue",fontsize="10",style="solid",fontname="Helvetica"];
  Node43 -> Node46 [color="midnightblue",fontsize="10",style="solid",fontname="Helvetica"];
  Node46 [label="ACL/Transport/MessageRouter\lObserverInterface.h",height=0.2,width=0.4,color="black", fillcolor="white", style="filled",URL="$_message_router_observer_interface_8h.html"];
  Node46 -> Node12 [color="midnightblue",fontsize="10",style="solid",fontname="Helvetica"];
  Node46 -> Node47 [color="midnightblue",fontsize="10",style="solid",fontname="Helvetica"];
  Node47 [label="AVSCommon/SDKInterfaces\l/ConnectionStatusObserverInterface.h",height=0.2,width=0.4,color="black", fillcolor="white", style="filled",URL="$_connection_status_observer_interface_8h.html"];
  Node47 -> Node11 [color="midnightblue",fontsize="10",style="solid",fontname="Helvetica"];
  Node43 -> Node48 [color="midnightblue",fontsize="10",style="solid",fontname="Helvetica"];
  Node48 [label="ACL/Transport/TransportInterface.h",height=0.2,width=0.4,color="black", fillcolor="white", style="filled",URL="$_transport_interface_8h.html"];
  Node48 -> Node12 [color="midnightblue",fontsize="10",style="solid",fontname="Helvetica"];
  Node48 -> Node36 [color="midnightblue",fontsize="10",style="solid",fontname="Helvetica"];
  Node48 -> Node44 [color="midnightblue",fontsize="10",style="solid",fontname="Helvetica"];
  Node43 -> Node49 [color="midnightblue",fontsize="10",style="solid",fontname="Helvetica"];
  Node49 [label="ACL/Transport/TransportObserver\lInterface.h",height=0.2,width=0.4,color="black", fillcolor="white", style="filled",URL="$_transport_observer_interface_8h.html"];
  Node49 -> Node12 [color="midnightblue",fontsize="10",style="solid",fontname="Helvetica"];
  Node49 -> Node48 [color="midnightblue",fontsize="10",style="solid",fontname="Helvetica"];
  Node49 -> Node47 [color="midnightblue",fontsize="10",style="solid",fontname="Helvetica"];
  Node31 -> Node46 [color="midnightblue",fontsize="10",style="solid",fontname="Helvetica"];
  Node31 -> Node50 [color="midnightblue",fontsize="10",style="solid",fontname="Helvetica"];
  Node50 [label="ACL/Transport/TransportFactory\lInterface.h",height=0.2,width=0.4,color="black", fillcolor="white", style="filled",URL="$_transport_factory_interface_8h.html"];
  Node50 -> Node12 [color="midnightblue",fontsize="10",style="solid",fontname="Helvetica"];
  Node50 -> Node13 [color="midnightblue",fontsize="10",style="solid",fontname="Helvetica"];
  Node50 -> Node40 [color="midnightblue",fontsize="10",style="solid",fontname="Helvetica"];
  Node50 -> Node32 [color="midnightblue",fontsize="10",style="solid",fontname="Helvetica"];
  Node50 -> Node48 [color="midnightblue",fontsize="10",style="solid",fontname="Helvetica"];
  Node50 -> Node42 [color="midnightblue",fontsize="10",style="solid",fontname="Helvetica"];
  Node50 -> Node49 [color="midnightblue",fontsize="10",style="solid",fontname="Helvetica"];
  Node31 -> Node48 [color="midnightblue",fontsize="10",style="solid",fontname="Helvetica"];
  Node31 -> Node49 [color="midnightblue",fontsize="10",style="solid",fontname="Helvetica"];
}
