digraph "/workplace/avs-device-sdk/BluetoothImplementations/BlueZ/include/BlueZ/PulseAudioBluetoothInitializer.h"
{
  edge [fontname="Helvetica",fontsize="10",labelfontname="Helvetica",labelfontsize="10"];
  node [fontname="Helvetica",fontsize="10",shape=record];
  Node1 [label="/workplace/avs-device\l-sdk/BluetoothImplementations\l/BlueZ/include/BlueZ/PulseAudioBluetooth\lInitializer.h",height=0.2,width=0.4,color="black", fillcolor="grey75", style="filled", fontcolor="black"];
  Node1 -> Node2 [color="midnightblue",fontsize="10",style="solid",fontname="Helvetica"];
  Node2 [label="condition_variable",height=0.2,width=0.4,color="grey75", fillcolor="white", style="filled"];
  Node1 -> Node3 [color="midnightblue",fontsize="10",style="solid",fontname="Helvetica"];
  Node3 [label="memory",height=0.2,width=0.4,color="grey75", fillcolor="white", style="filled"];
  Node1 -> Node4 [color="midnightblue",fontsize="10",style="solid",fontname="Helvetica"];
  Node4 [label="mutex",height=0.2,width=0.4,color="grey75", fillcolor="white", style="filled"];
  Node1 -> Node5 [color="midnightblue",fontsize="10",style="solid",fontname="Helvetica"];
  Node5 [label="AVSCommon/Utils/Bluetooth\l/BluetoothEventBus.h",height=0.2,width=0.4,color="black", fillcolor="white", style="filled",URL="$_bluetooth_event_bus_8h.html"];
  Node5 -> Node3 [color="midnightblue",fontsize="10",style="solid",fontname="Helvetica"];
  Node5 -> Node4 [color="midnightblue",fontsize="10",style="solid",fontname="Helvetica"];
  Node5 -> Node6 [color="midnightblue",fontsize="10",style="solid",fontname="Helvetica"];
  Node6 [label="unordered_map",height=0.2,width=0.4,color="grey75", fillcolor="white", style="filled"];
  Node5 -> Node7 [color="midnightblue",fontsize="10",style="solid",fontname="Helvetica"];
  Node7 [label="list",height=0.2,width=0.4,color="grey75", fillcolor="white", style="filled"];
  Node5 -> Node8 [color="midnightblue",fontsize="10",style="solid",fontname="Helvetica"];
  Node8 [label="string",height=0.2,width=0.4,color="grey75", fillcolor="white", style="filled"];
  Node5 -> Node9 [color="midnightblue",fontsize="10",style="solid",fontname="Helvetica"];
  Node9 [label="vector",height=0.2,width=0.4,color="grey75", fillcolor="white", style="filled"];
  Node5 -> Node10 [color="midnightblue",fontsize="10",style="solid",fontname="Helvetica"];
  Node10 [label="AVSCommon/Utils/Bluetooth\l/BluetoothEvents.h",height=0.2,width=0.4,color="black", fillcolor="white", style="filled",URL="$_bluetooth_events_8h.html"];
  Node10 -> Node11 [color="midnightblue",fontsize="10",style="solid",fontname="Helvetica"];
  Node11 [label="AVSCommon/SDKInterfaces\l/Bluetooth/BluetoothDeviceInterface.h",height=0.2,width=0.4,color="black", fillcolor="white", style="filled",URL="$_bluetooth_device_interface_8h.html"];
  Node11 -> Node12 [color="midnightblue",fontsize="10",style="solid",fontname="Helvetica"];
  Node12 [label="future",height=0.2,width=0.4,color="grey75", fillcolor="white", style="filled"];
  Node11 -> Node3 [color="midnightblue",fontsize="10",style="solid",fontname="Helvetica"];
  Node11 -> Node13 [color="midnightblue",fontsize="10",style="solid",fontname="Helvetica"];
  Node13 [label="ostream",height=0.2,width=0.4,color="grey75", fillcolor="white", style="filled"];
  Node11 -> Node8 [color="midnightblue",fontsize="10",style="solid",fontname="Helvetica"];
  Node11 -> Node9 [color="midnightblue",fontsize="10",style="solid",fontname="Helvetica"];
  Node11 -> Node14 [color="midnightblue",fontsize="10",style="solid",fontname="Helvetica"];
  Node14 [label="AVSCommon/SDKInterfaces\l/Bluetooth/Services/A2DPSource\lInterface.h",height=0.2,width=0.4,color="black", fillcolor="white", style="filled",URL="$_a2_d_p_source_interface_8h.html"];
  Node14 -> Node3 [color="midnightblue",fontsize="10",style="solid",fontname="Helvetica"];
  Node14 -> Node15 [color="midnightblue",fontsize="10",style="solid",fontname="Helvetica"];
  Node15 [label="AVSCommon/SDKInterfaces\l/Bluetooth/Services/Bluetooth\lServiceInterface.h",height=0.2,width=0.4,color="black", fillcolor="white", style="filled",URL="$_bluetooth_service_interface_8h.html"];
  Node15 -> Node3 [color="midnightblue",fontsize="10",style="solid",fontname="Helvetica"];
  Node15 -> Node16 [color="midnightblue",fontsize="10",style="solid",fontname="Helvetica"];
  Node16 [label="AVSCommon/SDKInterfaces\l/Bluetooth/Services/SDPRecord\lInterface.h",height=0.2,width=0.4,color="black", fillcolor="white", style="filled",URL="$_s_d_p_record_interface_8h.html"];
  Node16 -> Node8 [color="midnightblue",fontsize="10",style="solid",fontname="Helvetica"];
  Node14 -> Node17 [color="midnightblue",fontsize="10",style="solid",fontname="Helvetica"];
  Node17 [label="AVSCommon/Utils/Bluetooth\l/FormattedAudioStreamAdapter.h",height=0.2,width=0.4,color="black", fillcolor="white", style="filled",URL="$_formatted_audio_stream_adapter_8h.html"];
  Node17 -> Node3 [color="midnightblue",fontsize="10",style="solid",fontname="Helvetica"];
  Node17 -> Node4 [color="midnightblue",fontsize="10",style="solid",fontname="Helvetica"];
  Node17 -> Node18 [color="midnightblue",fontsize="10",style="solid",fontname="Helvetica"];
  Node18 [label="AVSCommon/Utils/AudioFormat.h",height=0.2,width=0.4,color="black", fillcolor="white", style="filled",URL="$_audio_format_8h.html"];
  Node18 -> Node13 [color="midnightblue",fontsize="10",style="solid",fontname="Helvetica"];
  Node17 -> Node19 [color="midnightblue",fontsize="10",style="solid",fontname="Helvetica"];
  Node19 [label="AVSCommon/Utils/Bluetooth\l/FormattedAudioStreamAdapterListener.h",height=0.2,width=0.4,color="black", fillcolor="white", style="filled",URL="$_formatted_audio_stream_adapter_listener_8h.html"];
  Node19 -> Node18 [color="midnightblue",fontsize="10",style="solid",fontname="Helvetica"];
  Node11 -> Node20 [color="midnightblue",fontsize="10",style="solid",fontname="Helvetica"];
  Node20 [label="AVSCommon/SDKInterfaces\l/Bluetooth/Services/A2DPSink\lInterface.h",height=0.2,width=0.4,color="black", fillcolor="white", style="filled",URL="$_a2_d_p_sink_interface_8h.html"];
  Node20 -> Node15 [color="midnightblue",fontsize="10",style="solid",fontname="Helvetica"];
  Node11 -> Node21 [color="midnightblue",fontsize="10",style="solid",fontname="Helvetica"];
  Node21 [label="AVSCommon/SDKInterfaces\l/Bluetooth/Services/AVRCPController\lInterface.h",height=0.2,width=0.4,color="black", fillcolor="white", style="filled",URL="$_a_v_r_c_p_controller_interface_8h.html"];
  Node21 -> Node15 [color="midnightblue",fontsize="10",style="solid",fontname="Helvetica"];
  Node11 -> Node22 [color="midnightblue",fontsize="10",style="solid",fontname="Helvetica"];
  Node22 [label="AVSCommon/SDKInterfaces\l/Bluetooth/Services/AVRCPTarget\lInterface.h",height=0.2,width=0.4,color="black", fillcolor="white", style="filled",URL="$_a_v_r_c_p_target_interface_8h.html"];
  Node22 -> Node13 [color="midnightblue",fontsize="10",style="solid",fontname="Helvetica"];
  Node22 -> Node8 [color="midnightblue",fontsize="10",style="solid",fontname="Helvetica"];
  Node22 -> Node15 [color="midnightblue",fontsize="10",style="solid",fontname="Helvetica"];
  Node11 -> Node15 [color="midnightblue",fontsize="10",style="solid",fontname="Helvetica"];
  Node11 -> Node16 [color="midnightblue",fontsize="10",style="solid",fontname="Helvetica"];
  Node10 -> Node14 [color="midnightblue",fontsize="10",style="solid",fontname="Helvetica"];
  Node10 -> Node22 [color="midnightblue",fontsize="10",style="solid",fontname="Helvetica"];
  Node10 -> Node23 [color="midnightblue",fontsize="10",style="solid",fontname="Helvetica"];
  Node23 [label="AVSCommon/Utils/Bluetooth\l/A2DPRole.h",height=0.2,width=0.4,color="black", fillcolor="white", style="filled",URL="$_a2_d_p_role_8h.html"];
  Node5 -> Node24 [color="midnightblue",fontsize="10",style="solid",fontname="Helvetica"];
  Node24 [label="AVSCommon/Utils/Bluetooth\l/BluetoothEventListenerInterface.h",height=0.2,width=0.4,color="black", fillcolor="white", style="filled",URL="$_bluetooth_event_listener_interface_8h.html"];
  Node24 -> Node10 [color="midnightblue",fontsize="10",style="solid",fontname="Helvetica"];
  Node1 -> Node25 [color="midnightblue",fontsize="10",style="solid",fontname="Helvetica"];
  Node25 [label="AVSCommon/Utils/Threading\l/Executor.h",height=0.2,width=0.4,color="black", fillcolor="white", style="filled",URL="$_executor_8h.html"];
  Node25 -> Node26 [color="midnightblue",fontsize="10",style="solid",fontname="Helvetica"];
  Node26 [label="atomic",height=0.2,width=0.4,color="grey75", fillcolor="white", style="filled"];
  Node25 -> Node2 [color="midnightblue",fontsize="10",style="solid",fontname="Helvetica"];
  Node25 -> Node27 [color="midnightblue",fontsize="10",style="solid",fontname="Helvetica"];
  Node27 [label="chrono",height=0.2,width=0.4,color="grey75", fillcolor="white", style="filled"];
  Node25 -> Node28 [color="midnightblue",fontsize="10",style="solid",fontname="Helvetica"];
  Node28 [label="deque",height=0.2,width=0.4,color="grey75", fillcolor="white", style="filled"];
  Node25 -> Node29 [color="midnightblue",fontsize="10",style="solid",fontname="Helvetica"];
  Node29 [label="functional",height=0.2,width=0.4,color="grey75", fillcolor="white", style="filled"];
  Node25 -> Node12 [color="midnightblue",fontsize="10",style="solid",fontname="Helvetica"];
  Node25 -> Node3 [color="midnightblue",fontsize="10",style="solid",fontname="Helvetica"];
  Node25 -> Node4 [color="midnightblue",fontsize="10",style="solid",fontname="Helvetica"];
  Node25 -> Node30 [color="midnightblue",fontsize="10",style="solid",fontname="Helvetica"];
  Node30 [label="utility",height=0.2,width=0.4,color="grey75", fillcolor="white", style="filled"];
  Node25 -> Node31 [color="midnightblue",fontsize="10",style="solid",fontname="Helvetica"];
  Node31 [label="AVSCommon/Utils/Threading\l/TaskThread.h",height=0.2,width=0.4,color="black", fillcolor="white", style="filled",URL="$_task_thread_8h.html"];
  Node31 -> Node26 [color="midnightblue",fontsize="10",style="solid",fontname="Helvetica"];
  Node31 -> Node29 [color="midnightblue",fontsize="10",style="solid",fontname="Helvetica"];
  Node31 -> Node8 [color="midnightblue",fontsize="10",style="solid",fontname="Helvetica"];
  Node31 -> Node32 [color="midnightblue",fontsize="10",style="solid",fontname="Helvetica"];
  Node32 [label="thread",height=0.2,width=0.4,color="grey75", fillcolor="white", style="filled"];
  Node1 -> Node33 [color="midnightblue",fontsize="10",style="solid",fontname="Helvetica"];
  Node33 [label="pulse/pulseaudio.h",height=0.2,width=0.4,color="grey75", fillcolor="white", style="filled"];
}
