digraph "/workplace/avs-device-sdk/EqualizerImplementations/include/EqualizerImplementations/EqualizerLinearBandMapper.h"
{
  edge [fontname="Helvetica",fontsize="10",labelfontname="Helvetica",labelfontsize="10"];
  node [fontname="Helvetica",fontsize="10",shape=record];
  Node1 [label="/workplace/avs-device\l-sdk/EqualizerImplementations\l/include/EqualizerImplementations\l/EqualizerLinearBandMapper.h",height=0.2,width=0.4,color="black", fillcolor="grey75", style="filled", fontcolor="black"];
  Node1 -> Node2 [dir="back",color="midnightblue",fontsize="10",style="solid",fontname="Helvetica"];
  Node2 [label="/workplace/avs-device\l-sdk/EqualizerImplementations\l/src/EqualizerLinearBandMapper.cpp",height=0.2,width=0.4,color="black", fillcolor="white", style="filled",URL="$_equalizer_linear_band_mapper_8cpp.html"];
  Node1 -> Node3 [dir="back",color="midnightblue",fontsize="10",style="solid",fontname="Helvetica"];
  Node3 [label="/workplace/avs-device\l-sdk/EqualizerImplementations\l/test/EqualizerLinearBandMapperTest.cpp",height=0.2,width=0.4,color="black", fillcolor="white", style="filled",URL="$_equalizer_linear_band_mapper_test_8cpp.html"];
  Node1 -> Node4 [dir="back",color="midnightblue",fontsize="10",style="solid",fontname="Helvetica"];
  Node4 [label="/workplace/avs-device\l-sdk/MediaPlayer/AndroidSLESMedia\lPlayer/src/AndroidSLESMediaPlayer.cpp",height=0.2,width=0.4,color="black", fillcolor="white", style="filled",URL="$_android_s_l_e_s_media_player_8cpp.html"];
}
