digraph "/workplace/avs-device-sdk/AVSCommon/Utils/include/AVSCommon/Utils/MediaPlayer" {
  compound=true
  node [ fontsize="10", fontname="Helvetica"];
  edge [ labelfontsize="10", labelfontname="Helvetica"];
  subgraph clusterdir_ee116be5d1129358ffaec72096859541 {
    graph [ bgcolor="#ddddee", pencolor="black", label="Utils" fontname="Helvetica", fontsize="10", URL="dir_ee116be5d1129358ffaec72096859541.html"]
  dir_2255c9d1605cd31ab93ea032c5611101 [shape=box, label="MediaPlayer", style="filled", fillcolor="#eeeeff", pencolor="black", URL="dir_2255c9d1605cd31ab93ea032c5611101.html"];
  }
  dir_80711c2a226d5fced33fce22558d3784 [shape=box label="AVS" fillcolor="white" style="filled" color="red" URL="dir_80711c2a226d5fced33fce22558d3784.html"];
  dir_2255c9d1605cd31ab93ea032c5611101->dir_80711c2a226d5fced33fce22558d3784 [headlabel="1", labeldistance=1.5 headhref="dir_000093_000043.html"];
}
