digraph "/workplace/avs-device-sdk/ADSL/test/ADSL" {
  compound=true
  node [ fontsize="10", fontname="Helvetica"];
  edge [ labelfontsize="10", labelfontname="Helvetica"];
  subgraph clusterdir_643f80818ad84cb2dca1de60fca00683 {
    graph [ bgcolor="#ddddee", pencolor="black", label="test" fontname="Helvetica", fontsize="10", URL="dir_643f80818ad84cb2dca1de60fca00683.html"]
  dir_d86d748ec05cd243cab7cd79a40f06a5 [shape=box, label="ADSL", style="filled", fillcolor="#eeeeff", pencolor="black", URL="dir_d86d748ec05cd243cab7cd79a40f06a5.html"];
  }
  dir_13e65effb2bde530b17b3d5eefcd0266 [shape=box label="AVSCommon" fillcolor="white" style="filled" color="red" URL="dir_13e65effb2bde530b17b3d5eefcd0266.html"];
  dir_d86d748ec05cd243cab7cd79a40f06a5->dir_13e65effb2bde530b17b3d5eefcd0266 [headlabel="2", labeldistance=1.5 headhref="dir_000014_000015.html"];
}
