digraph "/workplace/avs-device-sdk/BluetoothImplementations/BlueZ/include/BlueZ/ManagedGVariant.h"
{
  edge [fontname="Helvetica",fontsize="10",labelfontname="Helvetica",labelfontsize="10"];
  node [fontname="Helvetica",fontsize="10",shape=record];
  Node1 [label="/workplace/avs-device\l-sdk/BluetoothImplementations\l/BlueZ/include/BlueZ/ManagedGVariant.h",height=0.2,width=0.4,color="black", fillcolor="grey75", style="filled", fontcolor="black"];
  Node1 -> Node2 [dir="back",color="midnightblue",fontsize="10",style="solid",fontname="Helvetica"];
  Node2 [label="/workplace/avs-device\l-sdk/BluetoothImplementations\l/BlueZ/include/BlueZ/BlueZUtils.h",height=0.2,width=0.4,color="black", fillcolor="white", style="filled",URL="$_blue_z_utils_8h.html"];
  Node2 -> Node3 [dir="back",color="midnightblue",fontsize="10",style="solid",fontname="Helvetica"];
  Node3 [label="/workplace/avs-device\l-sdk/BluetoothImplementations\l/BlueZ/include/BlueZ/BlueZAVRCPTarget.h",height=0.2,width=0.4,color="black", fillcolor="white", style="filled",URL="$_blue_z_a_v_r_c_p_target_8h.html"];
  Node3 -> Node4 [dir="back",color="midnightblue",fontsize="10",style="solid",fontname="Helvetica"];
  Node4 [label="/workplace/avs-device\l-sdk/BluetoothImplementations\l/BlueZ/src/BlueZAVRCPTarget.cpp",height=0.2,width=0.4,color="black", fillcolor="white", style="filled",URL="$_blue_z_a_v_r_c_p_target_8cpp.html"];
  Node3 -> Node5 [dir="back",color="midnightblue",fontsize="10",style="solid",fontname="Helvetica"];
  Node5 [label="/workplace/avs-device\l-sdk/BluetoothImplementations\l/BlueZ/src/BlueZBluetoothDevice.cpp",height=0.2,width=0.4,color="black", fillcolor="white", style="filled",URL="$_blue_z_bluetooth_device_8cpp.html"];
  Node3 -> Node6 [dir="back",color="midnightblue",fontsize="10",style="solid",fontname="Helvetica"];
  Node6 [label="/workplace/avs-device\l-sdk/BluetoothImplementations\l/BlueZ/test/BlueZAVRCPTargetTest.cpp",height=0.2,width=0.4,color="black", fillcolor="white", style="filled",URL="$_blue_z_a_v_r_c_p_target_test_8cpp.html"];
  Node2 -> Node7 [dir="back",color="midnightblue",fontsize="10",style="solid",fontname="Helvetica"];
  Node7 [label="/workplace/avs-device\l-sdk/BluetoothImplementations\l/BlueZ/include/BlueZ/BlueZDeviceManager.h",height=0.2,width=0.4,color="black", fillcolor="white", style="filled",URL="$_blue_z_device_manager_8h.html"];
  Node7 -> Node8 [dir="back",color="midnightblue",fontsize="10",style="solid",fontname="Helvetica"];
  Node8 [label="/workplace/avs-device\l-sdk/BluetoothImplementations\l/BlueZ/include/BlueZ/BlueZBluetooth\lDeviceManager.h",height=0.2,width=0.4,color="black", fillcolor="white", style="filled",URL="$_blue_z_bluetooth_device_manager_8h.html"];
  Node8 -> Node9 [dir="back",color="midnightblue",fontsize="10",style="solid",fontname="Helvetica"];
  Node9 [label="/workplace/avs-device\l-sdk/BluetoothImplementations\l/BlueZ/src/BlueZBluetoothDeviceManager.cpp",height=0.2,width=0.4,color="black", fillcolor="white", style="filled",URL="$_blue_z_bluetooth_device_manager_8cpp.html"];
  Node7 -> Node10 [dir="back",color="midnightblue",fontsize="10",style="solid",fontname="Helvetica"];
  Node10 [label="/workplace/avs-device\l-sdk/BluetoothImplementations\l/BlueZ/include/BlueZ/MediaEndpoint.h",height=0.2,width=0.4,color="black", fillcolor="white", style="filled",URL="$_media_endpoint_8h.html"];
  Node10 -> Node11 [dir="back",color="midnightblue",fontsize="10",style="solid",fontname="Helvetica"];
  Node11 [label="/workplace/avs-device\l-sdk/BluetoothImplementations\l/BlueZ/src/BlueZA2DPSource.cpp",height=0.2,width=0.4,color="black", fillcolor="white", style="filled",URL="$_blue_z_a2_d_p_source_8cpp.html"];
  Node10 -> Node12 [dir="back",color="midnightblue",fontsize="10",style="solid",fontname="Helvetica"];
  Node12 [label="/workplace/avs-device\l-sdk/BluetoothImplementations\l/BlueZ/src/BlueZDeviceManager.cpp",height=0.2,width=0.4,color="black", fillcolor="white", style="filled",URL="$_blue_z_device_manager_8cpp.html"];
  Node10 -> Node13 [dir="back",color="midnightblue",fontsize="10",style="solid",fontname="Helvetica"];
  Node13 [label="/workplace/avs-device\l-sdk/BluetoothImplementations\l/BlueZ/src/MediaEndpoint.cpp",height=0.2,width=0.4,color="black", fillcolor="white", style="filled",URL="$_media_endpoint_8cpp.html"];
  Node7 -> Node14 [dir="back",color="midnightblue",fontsize="10",style="solid",fontname="Helvetica"];
  Node14 [label="/workplace/avs-device\l-sdk/BluetoothImplementations\l/BlueZ/src/BlueZA2DPSink.cpp",height=0.2,width=0.4,color="black", fillcolor="white", style="filled",URL="$_blue_z_a2_d_p_sink_8cpp.html"];
  Node7 -> Node11 [dir="back",color="midnightblue",fontsize="10",style="solid",fontname="Helvetica"];
  Node7 -> Node5 [dir="back",color="midnightblue",fontsize="10",style="solid",fontname="Helvetica"];
  Node7 -> Node12 [dir="back",color="midnightblue",fontsize="10",style="solid",fontname="Helvetica"];
  Node7 -> Node15 [dir="back",color="midnightblue",fontsize="10",style="solid",fontname="Helvetica"];
  Node15 [label="/workplace/avs-device\l-sdk/BluetoothImplementations\l/BlueZ/src/BlueZHostController.cpp",height=0.2,width=0.4,color="black", fillcolor="white", style="filled",URL="$_blue_z_host_controller_8cpp.html"];
  Node7 -> Node16 [dir="back",color="midnightblue",fontsize="10",style="solid",fontname="Helvetica"];
  Node16 [label="/workplace/avs-device\l-sdk/BluetoothImplementations\l/BlueZ/src/DBusPropertiesProxy.cpp",height=0.2,width=0.4,color="black", fillcolor="white", style="filled",URL="$_d_bus_properties_proxy_8cpp.html"];
  Node7 -> Node17 [dir="back",color="midnightblue",fontsize="10",style="solid",fontname="Helvetica"];
  Node17 [label="/workplace/avs-device\l-sdk/BluetoothImplementations\l/BlueZ/src/MPRISPlayer.cpp",height=0.2,width=0.4,color="black", fillcolor="white", style="filled",URL="$_m_p_r_i_s_player_8cpp.html"];
  Node7 -> Node18 [dir="back",color="midnightblue",fontsize="10",style="solid",fontname="Helvetica"];
  Node18 [label="/workplace/avs-device\l-sdk/BluetoothImplementations\l/BlueZ/src/PairingAgent.cpp",height=0.2,width=0.4,color="black", fillcolor="white", style="filled",URL="$_pairing_agent_8cpp.html"];
  Node2 -> Node19 [dir="back",color="midnightblue",fontsize="10",style="solid",fontname="Helvetica"];
  Node19 [label="/workplace/avs-device\l-sdk/BluetoothImplementations\l/BlueZ/include/BlueZ/BlueZHostController.h",height=0.2,width=0.4,color="black", fillcolor="white", style="filled",URL="$_blue_z_host_controller_8h.html"];
  Node19 -> Node7 [dir="back",color="midnightblue",fontsize="10",style="solid",fontname="Helvetica"];
  Node19 -> Node12 [dir="back",color="midnightblue",fontsize="10",style="solid",fontname="Helvetica"];
  Node19 -> Node15 [dir="back",color="midnightblue",fontsize="10",style="solid",fontname="Helvetica"];
  Node2 -> Node20 [dir="back",color="midnightblue",fontsize="10",style="solid",fontname="Helvetica"];
  Node20 [label="/workplace/avs-device\l-sdk/BluetoothImplementations\l/BlueZ/include/BlueZ/DBusProxy.h",height=0.2,width=0.4,color="black", fillcolor="white", style="filled",URL="$_d_bus_proxy_8h.html"];
  Node20 -> Node21 [dir="back",color="midnightblue",fontsize="10",style="solid",fontname="Helvetica"];
  Node21 [label="/workplace/avs-device\l-sdk/BluetoothImplementations\l/BlueZ/include/BlueZ/DBusProperties\lProxy.h",height=0.2,width=0.4,color="black", fillcolor="white", style="filled",URL="$_d_bus_properties_proxy_8h.html"];
  Node21 -> Node22 [dir="back",color="midnightblue",fontsize="10",style="solid",fontname="Helvetica"];
  Node22 [label="/workplace/avs-device\l-sdk/BluetoothImplementations\l/BlueZ/include/BlueZ/BlueZBluetooth\lDevice.h",height=0.2,width=0.4,color="black", fillcolor="white", style="filled",URL="$_blue_z_bluetooth_device_8h.html"];
  Node22 -> Node3 [dir="back",color="midnightblue",fontsize="10",style="solid",fontname="Helvetica"];
  Node22 -> Node5 [dir="back",color="midnightblue",fontsize="10",style="solid",fontname="Helvetica"];
  Node22 -> Node12 [dir="back",color="midnightblue",fontsize="10",style="solid",fontname="Helvetica"];
  Node21 -> Node19 [dir="back",color="midnightblue",fontsize="10",style="solid",fontname="Helvetica"];
  Node21 -> Node16 [dir="back",color="midnightblue",fontsize="10",style="solid",fontname="Helvetica"];
  Node20 -> Node23 [dir="back",color="midnightblue",fontsize="10",style="solid",fontname="Helvetica"];
  Node23 [label="/workplace/avs-device\l-sdk/BluetoothImplementations\l/BlueZ/include/BlueZ/MPRISPlayer.h",height=0.2,width=0.4,color="black", fillcolor="white", style="filled",URL="$_m_p_r_i_s_player_8h.html"];
  Node23 -> Node7 [dir="back",color="midnightblue",fontsize="10",style="solid",fontname="Helvetica"];
  Node23 -> Node17 [dir="back",color="midnightblue",fontsize="10",style="solid",fontname="Helvetica"];
  Node23 -> Node24 [dir="back",color="midnightblue",fontsize="10",style="solid",fontname="Helvetica"];
  Node24 [label="/workplace/avs-device\l-sdk/BluetoothImplementations\l/BlueZ/test/MPRISPlayerTest.cpp",height=0.2,width=0.4,color="black", fillcolor="white", style="filled",URL="$_m_p_r_i_s_player_test_8cpp.html"];
  Node20 -> Node25 [dir="back",color="midnightblue",fontsize="10",style="solid",fontname="Helvetica"];
  Node25 [label="/workplace/avs-device\l-sdk/BluetoothImplementations\l/BlueZ/include/BlueZ/PairingAgent.h",height=0.2,width=0.4,color="black", fillcolor="white", style="filled",URL="$_pairing_agent_8h.html"];
  Node25 -> Node7 [dir="back",color="midnightblue",fontsize="10",style="solid",fontname="Helvetica"];
  Node25 -> Node18 [dir="back",color="midnightblue",fontsize="10",style="solid",fontname="Helvetica"];
  Node20 -> Node26 [dir="back",color="midnightblue",fontsize="10",style="solid",fontname="Helvetica"];
  Node26 [label="/workplace/avs-device\l-sdk/BluetoothImplementations\l/BlueZ/src/DBusProxy.cpp",height=0.2,width=0.4,color="black", fillcolor="white", style="filled",URL="$_d_bus_proxy_8cpp.html"];
  Node2 -> Node10 [dir="back",color="midnightblue",fontsize="10",style="solid",fontname="Helvetica"];
  Node2 -> Node27 [dir="back",color="midnightblue",fontsize="10",style="solid",fontname="Helvetica"];
  Node27 [label="/workplace/avs-device\l-sdk/BluetoothImplementations\l/BlueZ/src/DBusConnection.cpp",height=0.2,width=0.4,color="black", fillcolor="white", style="filled",URL="$_d_bus_connection_8cpp.html"];
  Node2 -> Node28 [dir="back",color="midnightblue",fontsize="10",style="solid",fontname="Helvetica"];
  Node28 [label="/workplace/avs-device\l-sdk/BluetoothImplementations\l/BlueZ/src/DBusObjectBase.cpp",height=0.2,width=0.4,color="black", fillcolor="white", style="filled",URL="$_d_bus_object_base_8cpp.html"];
  Node2 -> Node29 [dir="back",color="midnightblue",fontsize="10",style="solid",fontname="Helvetica"];
  Node29 [label="/workplace/avs-device\l-sdk/BluetoothImplementations\l/BlueZ/test/Mock/include/MockDBusProxy.h",height=0.2,width=0.4,color="black", fillcolor="white", style="filled",URL="$_mock_d_bus_proxy_8h.html"];
  Node29 -> Node6 [dir="back",color="midnightblue",fontsize="10",style="solid",fontname="Helvetica"];
  Node29 -> Node24 [dir="back",color="midnightblue",fontsize="10",style="solid",fontname="Helvetica"];
  Node1 -> Node30 [dir="back",color="midnightblue",fontsize="10",style="solid",fontname="Helvetica"];
  Node30 [label="/workplace/avs-device\l-sdk/BluetoothImplementations\l/BlueZ/include/BlueZ/GVariantMapReader.h",height=0.2,width=0.4,color="black", fillcolor="white", style="filled",URL="$_g_variant_map_reader_8h.html"];
  Node30 -> Node2 [dir="back",color="midnightblue",fontsize="10",style="solid",fontname="Helvetica"];
  Node30 -> Node31 [dir="back",color="midnightblue",fontsize="10",style="solid",fontname="Helvetica"];
  Node31 [label="/workplace/avs-device\l-sdk/BluetoothImplementations\l/BlueZ/src/GVariantMapReader.cpp",height=0.2,width=0.4,color="black", fillcolor="white", style="filled",URL="$_g_variant_map_reader_8cpp.html"];
  Node1 -> Node32 [dir="back",color="midnightblue",fontsize="10",style="solid",fontname="Helvetica"];
  Node32 [label="/workplace/avs-device\l-sdk/BluetoothImplementations\l/BlueZ/include/BlueZ/GVariantTuple\lReader.h",height=0.2,width=0.4,color="black", fillcolor="white", style="filled",URL="$_g_variant_tuple_reader_8h.html"];
  Node32 -> Node2 [dir="back",color="midnightblue",fontsize="10",style="solid",fontname="Helvetica"];
  Node32 -> Node33 [dir="back",color="midnightblue",fontsize="10",style="solid",fontname="Helvetica"];
  Node33 [label="/workplace/avs-device\l-sdk/BluetoothImplementations\l/BlueZ/src/GVariantTupleReader.cpp",height=0.2,width=0.4,color="black", fillcolor="white", style="filled",URL="$_g_variant_tuple_reader_8cpp.html"];
}
