digraph "alexaClientSDK::avsCommon::sdkInterfaces::externalMediaPlayer::ExternalMediaPlayerObserverInterface"
{
  edge [fontname="Helvetica",fontsize="10",labelfontname="Helvetica",labelfontsize="10"];
  node [fontname="Helvetica",fontsize="10",shape=record];
  rankdir="LR";
  Node1 [label="alexaClientSDK::avsCommon\l::sdkInterfaces::externalMedia\lPlayer::ExternalMediaPlayerObserver\lInterface",height=0.2,width=0.4,color="black", fillcolor="grey75", style="filled", fontcolor="black"];
  Node1 -> Node2 [dir="back",color="midnightblue",fontsize="10",style="solid",fontname="Helvetica"];
  Node2 [label="alexaClientSDK::capability\lAgents::externalMediaPlayer\l::test::MockExternalMediaPlayerObserver",height=0.2,width=0.4,color="black", fillcolor="white", style="filled",URL="$classalexa_client_s_d_k_1_1capability_agents_1_1external_media_player_1_1test_1_1_mock_external_media_player_observer.html"];
}
