digraph "/workplace/avs-device-sdk/CapabilityAgents/Alerts/src/Reminder.cpp"
{
  edge [fontname="Helvetica",fontsize="10",labelfontname="Helvetica",labelfontsize="10"];
  node [fontname="Helvetica",fontsize="10",shape=record];
  Node1 [label="/workplace/avs-device\l-sdk/CapabilityAgents\l/Alerts/src/Reminder.cpp",height=0.2,width=0.4,color="black", fillcolor="grey75", style="filled", fontcolor="black"];
  Node1 -> Node2 [color="midnightblue",fontsize="10",style="solid",fontname="Helvetica"];
  Node2 [label="Alerts/Reminder.h",height=0.2,width=0.4,color="black", fillcolor="white", style="filled",URL="$_reminder_8h.html"];
  Node2 -> Node3 [color="midnightblue",fontsize="10",style="solid",fontname="Helvetica"];
  Node3 [label="Alerts/Alert.h",height=0.2,width=0.4,color="black", fillcolor="white", style="filled",URL="$_alert_8h.html"];
  Node3 -> Node4 [color="midnightblue",fontsize="10",style="solid",fontname="Helvetica"];
  Node4 [label="Alerts/AlertObserverInterface.h",height=0.2,width=0.4,color="black", fillcolor="white", style="filled",URL="$_alert_observer_interface_8h.html"];
  Node4 -> Node5 [color="midnightblue",fontsize="10",style="solid",fontname="Helvetica"];
  Node5 [label="string",height=0.2,width=0.4,color="grey75", fillcolor="white", style="filled"];
  Node3 -> Node6 [color="midnightblue",fontsize="10",style="solid",fontname="Helvetica"];
  Node6 [label="Alerts/Renderer/Renderer.h",height=0.2,width=0.4,color="black", fillcolor="white", style="filled",URL="$_renderer_8h.html"];
  Node6 -> Node7 [color="midnightblue",fontsize="10",style="solid",fontname="Helvetica"];
  Node7 [label="Alerts/Renderer/Renderer\lInterface.h",height=0.2,width=0.4,color="black", fillcolor="white", style="filled",URL="$_renderer_interface_8h.html"];
  Node7 -> Node8 [color="midnightblue",fontsize="10",style="solid",fontname="Helvetica"];
  Node8 [label="Alerts/Renderer/Renderer\lObserverInterface.h",height=0.2,width=0.4,color="black", fillcolor="white", style="filled",URL="$_renderer_observer_interface_8h.html"];
  Node8 -> Node5 [color="midnightblue",fontsize="10",style="solid",fontname="Helvetica"];
  Node7 -> Node9 [color="midnightblue",fontsize="10",style="solid",fontname="Helvetica"];
  Node9 [label="chrono",height=0.2,width=0.4,color="grey75", fillcolor="white", style="filled"];
  Node7 -> Node10 [color="midnightblue",fontsize="10",style="solid",fontname="Helvetica"];
  Node10 [label="functional",height=0.2,width=0.4,color="grey75", fillcolor="white", style="filled"];
  Node7 -> Node11 [color="midnightblue",fontsize="10",style="solid",fontname="Helvetica"];
  Node11 [label="memory",height=0.2,width=0.4,color="grey75", fillcolor="white", style="filled"];
  Node7 -> Node5 [color="midnightblue",fontsize="10",style="solid",fontname="Helvetica"];
  Node7 -> Node12 [color="midnightblue",fontsize="10",style="solid",fontname="Helvetica"];
  Node12 [label="vector",height=0.2,width=0.4,color="grey75", fillcolor="white", style="filled"];
  Node6 -> Node8 [color="midnightblue",fontsize="10",style="solid",fontname="Helvetica"];
  Node6 -> Node13 [color="midnightblue",fontsize="10",style="solid",fontname="Helvetica"];
  Node13 [label="AVSCommon/Utils/Threading\l/Executor.h",height=0.2,width=0.4,color="black", fillcolor="white", style="filled",URL="$_executor_8h.html"];
  Node13 -> Node14 [color="midnightblue",fontsize="10",style="solid",fontname="Helvetica"];
  Node14 [label="atomic",height=0.2,width=0.4,color="grey75", fillcolor="white", style="filled"];
  Node13 -> Node15 [color="midnightblue",fontsize="10",style="solid",fontname="Helvetica"];
  Node15 [label="condition_variable",height=0.2,width=0.4,color="grey75", fillcolor="white", style="filled"];
  Node13 -> Node9 [color="midnightblue",fontsize="10",style="solid",fontname="Helvetica"];
  Node13 -> Node16 [color="midnightblue",fontsize="10",style="solid",fontname="Helvetica"];
  Node16 [label="deque",height=0.2,width=0.4,color="grey75", fillcolor="white", style="filled"];
  Node13 -> Node10 [color="midnightblue",fontsize="10",style="solid",fontname="Helvetica"];
  Node13 -> Node17 [color="midnightblue",fontsize="10",style="solid",fontname="Helvetica"];
  Node17 [label="future",height=0.2,width=0.4,color="grey75", fillcolor="white", style="filled"];
  Node13 -> Node11 [color="midnightblue",fontsize="10",style="solid",fontname="Helvetica"];
  Node13 -> Node18 [color="midnightblue",fontsize="10",style="solid",fontname="Helvetica"];
  Node18 [label="mutex",height=0.2,width=0.4,color="grey75", fillcolor="white", style="filled"];
  Node13 -> Node19 [color="midnightblue",fontsize="10",style="solid",fontname="Helvetica"];
  Node19 [label="utility",height=0.2,width=0.4,color="grey75", fillcolor="white", style="filled"];
  Node13 -> Node20 [color="midnightblue",fontsize="10",style="solid",fontname="Helvetica"];
  Node20 [label="AVSCommon/Utils/Threading\l/TaskThread.h",height=0.2,width=0.4,color="black", fillcolor="white", style="filled",URL="$_task_thread_8h.html"];
  Node20 -> Node14 [color="midnightblue",fontsize="10",style="solid",fontname="Helvetica"];
  Node20 -> Node10 [color="midnightblue",fontsize="10",style="solid",fontname="Helvetica"];
  Node20 -> Node5 [color="midnightblue",fontsize="10",style="solid",fontname="Helvetica"];
  Node20 -> Node21 [color="midnightblue",fontsize="10",style="solid",fontname="Helvetica"];
  Node21 [label="thread",height=0.2,width=0.4,color="grey75", fillcolor="white", style="filled"];
  Node6 -> Node22 [color="midnightblue",fontsize="10",style="solid",fontname="Helvetica"];
  Node22 [label="AVSCommon/Utils/MediaPlayer\l/MediaPlayerInterface.h",height=0.2,width=0.4,color="black", fillcolor="white", style="filled",URL="$_media_player_interface_8h.html"];
  Node22 -> Node9 [color="midnightblue",fontsize="10",style="solid",fontname="Helvetica"];
  Node22 -> Node23 [color="midnightblue",fontsize="10",style="solid",fontname="Helvetica"];
  Node23 [label="cstdint",height=0.2,width=0.4,color="grey75", fillcolor="white", style="filled"];
  Node22 -> Node17 [color="midnightblue",fontsize="10",style="solid",fontname="Helvetica"];
  Node22 -> Node11 [color="midnightblue",fontsize="10",style="solid",fontname="Helvetica"];
  Node22 -> Node24 [color="midnightblue",fontsize="10",style="solid",fontname="Helvetica"];
  Node24 [label="AVSCommon/AVS/Attachment\l/AttachmentReader.h",height=0.2,width=0.4,color="black", fillcolor="white", style="filled",URL="$_attachment_reader_8h.html"];
  Node24 -> Node9 [color="midnightblue",fontsize="10",style="solid",fontname="Helvetica"];
  Node24 -> Node25 [color="midnightblue",fontsize="10",style="solid",fontname="Helvetica"];
  Node25 [label="cstddef",height=0.2,width=0.4,color="grey75", fillcolor="white", style="filled"];
  Node24 -> Node26 [color="midnightblue",fontsize="10",style="solid",fontname="Helvetica"];
  Node26 [label="ostream",height=0.2,width=0.4,color="grey75", fillcolor="white", style="filled"];
  Node24 -> Node27 [color="midnightblue",fontsize="10",style="solid",fontname="Helvetica"];
  Node27 [label="AVSCommon/Utils/SDS\l/ReaderPolicy.h",height=0.2,width=0.4,color="black", fillcolor="white", style="filled",URL="$_reader_policy_8h.html"];
  Node22 -> Node28 [color="midnightblue",fontsize="10",style="solid",fontname="Helvetica"];
  Node28 [label="AVSCommon/Utils/AudioFormat.h",height=0.2,width=0.4,color="black", fillcolor="white", style="filled",URL="$_audio_format_8h.html"];
  Node28 -> Node26 [color="midnightblue",fontsize="10",style="solid",fontname="Helvetica"];
  Node6 -> Node29 [color="midnightblue",fontsize="10",style="solid",fontname="Helvetica"];
  Node29 [label="AVSCommon/Utils/MediaPlayer\l/MediaPlayerObserverInterface.h",height=0.2,width=0.4,color="black", fillcolor="white", style="filled",URL="$_media_player_observer_interface_8h.html"];
  Node29 -> Node5 [color="midnightblue",fontsize="10",style="solid",fontname="Helvetica"];
  Node29 -> Node12 [color="midnightblue",fontsize="10",style="solid",fontname="Helvetica"];
  Node29 -> Node11 [color="midnightblue",fontsize="10",style="solid",fontname="Helvetica"];
  Node29 -> Node30 [color="midnightblue",fontsize="10",style="solid",fontname="Helvetica"];
  Node30 [label="AVSCommon/Utils/MediaPlayer\l/ErrorTypes.h",height=0.2,width=0.4,color="black", fillcolor="white", style="filled",URL="$_error_types_8h.html"];
  Node30 -> Node26 [color="midnightblue",fontsize="10",style="solid",fontname="Helvetica"];
  Node29 -> Node22 [color="midnightblue",fontsize="10",style="solid",fontname="Helvetica"];
  Node6 -> Node15 [color="midnightblue",fontsize="10",style="solid",fontname="Helvetica"];
  Node6 -> Node18 [color="midnightblue",fontsize="10",style="solid",fontname="Helvetica"];
  Node6 -> Node5 [color="midnightblue",fontsize="10",style="solid",fontname="Helvetica"];
  Node6 -> Node12 [color="midnightblue",fontsize="10",style="solid",fontname="Helvetica"];
  Node3 -> Node8 [color="midnightblue",fontsize="10",style="solid",fontname="Helvetica"];
  Node3 -> Node31 [color="midnightblue",fontsize="10",style="solid",fontname="Helvetica"];
  Node31 [label="AVSCommon/AVS/FocusState.h",height=0.2,width=0.4,color="black", fillcolor="white", style="filled",URL="$_focus_state_8h.html"];
  Node31 -> Node5 [color="midnightblue",fontsize="10",style="solid",fontname="Helvetica"];
  Node3 -> Node32 [color="midnightblue",fontsize="10",style="solid",fontname="Helvetica"];
  Node32 [label="AVSCommon/Utils/Timing\l/Timer.h",height=0.2,width=0.4,color="black", fillcolor="white", style="filled",URL="$_a_v_s_common_2_utils_2include_2_a_v_s_common_2_utils_2_timing_2_timer_8h.html"];
  Node32 -> Node9 [color="midnightblue",fontsize="10",style="solid",fontname="Helvetica"];
  Node32 -> Node15 [color="midnightblue",fontsize="10",style="solid",fontname="Helvetica"];
  Node32 -> Node10 [color="midnightblue",fontsize="10",style="solid",fontname="Helvetica"];
  Node32 -> Node17 [color="midnightblue",fontsize="10",style="solid",fontname="Helvetica"];
  Node32 -> Node18 [color="midnightblue",fontsize="10",style="solid",fontname="Helvetica"];
  Node32 -> Node21 [color="midnightblue",fontsize="10",style="solid",fontname="Helvetica"];
  Node32 -> Node33 [color="midnightblue",fontsize="10",style="solid",fontname="Helvetica"];
  Node33 [label="AVSCommon/Utils/Logger\l/LoggerUtils.h",height=0.2,width=0.4,color="black", fillcolor="white", style="filled",URL="$_logger_utils_8h.html"];
  Node33 -> Node9 [color="midnightblue",fontsize="10",style="solid",fontname="Helvetica"];
  Node33 -> Node34 [color="midnightblue",fontsize="10",style="solid",fontname="Helvetica"];
  Node34 [label="AVSCommon/Utils/Logger\l/Logger.h",height=0.2,width=0.4,color="black", fillcolor="white", style="filled",URL="$_logger_8h.html"];
  Node34 -> Node14 [color="midnightblue",fontsize="10",style="solid",fontname="Helvetica"];
  Node34 -> Node9 [color="midnightblue",fontsize="10",style="solid",fontname="Helvetica"];
  Node34 -> Node18 [color="midnightblue",fontsize="10",style="solid",fontname="Helvetica"];
  Node34 -> Node35 [color="midnightblue",fontsize="10",style="solid",fontname="Helvetica"];
  Node35 [label="sstream",height=0.2,width=0.4,color="grey75", fillcolor="white", style="filled"];
  Node34 -> Node12 [color="midnightblue",fontsize="10",style="solid",fontname="Helvetica"];
  Node34 -> Node36 [color="midnightblue",fontsize="10",style="solid",fontname="Helvetica"];
  Node36 [label="AVSCommon/Utils/Configuration\l/ConfigurationNode.h",height=0.2,width=0.4,color="black", fillcolor="white", style="filled",URL="$_configuration_node_8h.html"];
  Node36 -> Node9 [color="midnightblue",fontsize="10",style="solid",fontname="Helvetica"];
  Node36 -> Node37 [color="midnightblue",fontsize="10",style="solid",fontname="Helvetica"];
  Node37 [label="iostream",height=0.2,width=0.4,color="grey75", fillcolor="white", style="filled"];
  Node36 -> Node11 [color="midnightblue",fontsize="10",style="solid",fontname="Helvetica"];
  Node36 -> Node18 [color="midnightblue",fontsize="10",style="solid",fontname="Helvetica"];
  Node36 -> Node5 [color="midnightblue",fontsize="10",style="solid",fontname="Helvetica"];
  Node36 -> Node12 [color="midnightblue",fontsize="10",style="solid",fontname="Helvetica"];
  Node36 -> Node38 [color="midnightblue",fontsize="10",style="solid",fontname="Helvetica"];
  Node38 [label="rapidjson/document.h",height=0.2,width=0.4,color="grey75", fillcolor="white", style="filled"];
  Node34 -> Node39 [color="midnightblue",fontsize="10",style="solid",fontname="Helvetica"];
  Node39 [label="AVSCommon/Utils/Logger\l/Level.h",height=0.2,width=0.4,color="black", fillcolor="white", style="filled",URL="$_level_8h.html"];
  Node39 -> Node5 [color="midnightblue",fontsize="10",style="solid",fontname="Helvetica"];
  Node34 -> Node40 [color="midnightblue",fontsize="10",style="solid",fontname="Helvetica"];
  Node40 [label="AVSCommon/Utils/Logger\l/LogEntry.h",height=0.2,width=0.4,color="red", fillcolor="white", style="filled",URL="$_log_entry_8h.html"];
  Node40 -> Node35 [color="midnightblue",fontsize="10",style="solid",fontname="Helvetica"];
  Node40 -> Node5 [color="midnightblue",fontsize="10",style="solid",fontname="Helvetica"];
  Node34 -> Node41 [color="midnightblue",fontsize="10",style="solid",fontname="Helvetica"];
  Node41 [label="AVSCommon/Utils/Logger\l/LogLevelObserverInterface.h",height=0.2,width=0.4,color="black", fillcolor="white", style="filled",URL="$_log_level_observer_interface_8h.html"];
  Node41 -> Node39 [color="midnightblue",fontsize="10",style="solid",fontname="Helvetica"];
  Node34 -> Node42 [color="midnightblue",fontsize="10",style="solid",fontname="Helvetica"];
  Node42 [label="AVSCommon/Utils/Logger\l/SinkObserverInterface.h",height=0.2,width=0.4,color="black", fillcolor="white", style="filled",URL="$_sink_observer_interface_8h.html"];
  Node42 -> Node11 [color="midnightblue",fontsize="10",style="solid",fontname="Helvetica"];
  Node3 -> Node43 [color="midnightblue",fontsize="10",style="solid",fontname="Helvetica"];
  Node43 [label="AVSCommon/Utils/Timing\l/TimePoint.h",height=0.2,width=0.4,color="black", fillcolor="white", style="filled",URL="$_time_point_8h.html"];
  Node43 -> Node5 [color="midnightblue",fontsize="10",style="solid",fontname="Helvetica"];
  Node43 -> Node44 [color="midnightblue",fontsize="10",style="solid",fontname="Helvetica"];
  Node44 [label="AVSCommon/Utils/Timing\l/TimeUtils.h",height=0.2,width=0.4,color="black", fillcolor="white", style="filled",URL="$_time_utils_8h.html"];
  Node44 -> Node9 [color="midnightblue",fontsize="10",style="solid",fontname="Helvetica"];
  Node44 -> Node45 [color="midnightblue",fontsize="10",style="solid",fontname="Helvetica"];
  Node45 [label="ctime",height=0.2,width=0.4,color="grey75", fillcolor="white", style="filled"];
  Node44 -> Node5 [color="midnightblue",fontsize="10",style="solid",fontname="Helvetica"];
  Node44 -> Node46 [color="midnightblue",fontsize="10",style="solid",fontname="Helvetica"];
  Node46 [label="sys/time.h",height=0.2,width=0.4,color="grey75", fillcolor="white", style="filled"];
  Node44 -> Node47 [color="midnightblue",fontsize="10",style="solid",fontname="Helvetica"];
  Node47 [label="AVSCommon/Utils/RetryTimer.h",height=0.2,width=0.4,color="black", fillcolor="white", style="filled",URL="$_retry_timer_8h.html"];
  Node47 -> Node9 [color="midnightblue",fontsize="10",style="solid",fontname="Helvetica"];
  Node47 -> Node12 [color="midnightblue",fontsize="10",style="solid",fontname="Helvetica"];
  Node44 -> Node48 [color="midnightblue",fontsize="10",style="solid",fontname="Helvetica"];
  Node48 [label="AVSCommon/Utils/Timing\l/SafeCTimeAccess.h",height=0.2,width=0.4,color="black", fillcolor="white", style="filled",URL="$_safe_c_time_access_8h.html"];
  Node48 -> Node45 [color="midnightblue",fontsize="10",style="solid",fontname="Helvetica"];
  Node48 -> Node11 [color="midnightblue",fontsize="10",style="solid",fontname="Helvetica"];
  Node48 -> Node18 [color="midnightblue",fontsize="10",style="solid",fontname="Helvetica"];
  Node3 -> Node49 [color="midnightblue",fontsize="10",style="solid",fontname="Helvetica"];
  Node49 [label="map",height=0.2,width=0.4,color="grey75", fillcolor="white", style="filled"];
  Node3 -> Node11 [color="midnightblue",fontsize="10",style="solid",fontname="Helvetica"];
  Node3 -> Node18 [color="midnightblue",fontsize="10",style="solid",fontname="Helvetica"];
  Node3 -> Node5 [color="midnightblue",fontsize="10",style="solid",fontname="Helvetica"];
  Node3 -> Node50 [color="midnightblue",fontsize="10",style="solid",fontname="Helvetica"];
  Node50 [label="unordered_map",height=0.2,width=0.4,color="grey75", fillcolor="white", style="filled"];
  Node3 -> Node12 [color="midnightblue",fontsize="10",style="solid",fontname="Helvetica"];
  Node3 -> Node38 [color="midnightblue",fontsize="10",style="solid",fontname="Helvetica"];
}
