digraph "/workplace/avs-device-sdk/ACL/test/Transport/MockTransport.h"
{
  edge [fontname="Helvetica",fontsize="10",labelfontname="Helvetica",labelfontsize="10"];
  node [fontname="Helvetica",fontsize="10",shape=record];
  Node1 [label="/workplace/avs-device\l-sdk/ACL/test/Transport\l/MockTransport.h",height=0.2,width=0.4,color="black", fillcolor="grey75", style="filled", fontcolor="black"];
  Node1 -> Node2 [dir="back",color="midnightblue",fontsize="10",style="solid",fontname="Helvetica"];
  Node2 [label="/workplace/avs-device\l-sdk/ACL/test/Transport\l/MessageRouterTest.h",height=0.2,width=0.4,color="black", fillcolor="white", style="filled",URL="$_message_router_test_8h.html"];
  Node2 -> Node3 [dir="back",color="midnightblue",fontsize="10",style="solid",fontname="Helvetica"];
  Node3 [label="/workplace/avs-device\l-sdk/ACL/test/Transport\l/MessageRouterTest.cpp",height=0.2,width=0.4,color="black", fillcolor="white", style="filled",URL="$_message_router_test_8cpp.html"];
}
