digraph "/workplace/avs-device-sdk/AVSCommon/SDKInterfaces/include/AVSCommon/SDKInterfaces/Storage/MiscStorageInterface.h"
{
  edge [fontname="Helvetica",fontsize="10",labelfontname="Helvetica",labelfontsize="10"];
  node [fontname="Helvetica",fontsize="10",shape=record];
  Node1 [label="/workplace/avs-device\l-sdk/AVSCommon/SDKInterfaces\l/include/AVSCommon/SDKInterfaces\l/Storage/MiscStorageInterface.h",height=0.2,width=0.4,color="black", fillcolor="grey75", style="filled", fontcolor="black"];
  Node1 -> Node2 [dir="back",color="midnightblue",fontsize="10",style="solid",fontname="Helvetica"];
  Node2 [label="/workplace/avs-device\l-sdk/AVSCommon/SDKInterfaces\l/test/AVSCommon/SDKInterfaces\l/Storage/StubMiscStorage.h",height=0.2,width=0.4,color="black", fillcolor="white", style="filled",URL="$_stub_misc_storage_8h.html"];
  Node2 -> Node3 [dir="back",color="midnightblue",fontsize="10",style="solid",fontname="Helvetica"];
  Node3 [label="/workplace/avs-device\l-sdk/AVSCommon/SDKInterfaces\l/test/src/StubMiscStorage.cpp",height=0.2,width=0.4,color="black", fillcolor="white", style="filled",URL="$_stub_misc_storage_8cpp.html"];
  Node2 -> Node4 [dir="back",color="midnightblue",fontsize="10",style="solid",fontname="Helvetica"];
  Node4 [label="/workplace/avs-device\l-sdk/EqualizerImplementations\l/test/MiscDBEqualizerStorageTest.cpp",height=0.2,width=0.4,color="black", fillcolor="white", style="filled",URL="$_misc_d_b_equalizer_storage_test_8cpp.html"];
  Node1 -> Node5 [dir="back",color="midnightblue",fontsize="10",style="solid",fontname="Helvetica"];
  Node5 [label="/workplace/avs-device\l-sdk/CapabilitiesDelegate\l/include/CapabilitiesDelegate\l/CapabilitiesDelegate.h",height=0.2,width=0.4,color="black", fillcolor="white", style="filled",URL="$_capabilities_delegate_8h.html"];
  Node5 -> Node6 [dir="back",color="midnightblue",fontsize="10",style="solid",fontname="Helvetica"];
  Node6 [label="/workplace/avs-device\l-sdk/CapabilitiesDelegate\l/src/CapabilitiesDelegate.cpp",height=0.2,width=0.4,color="black", fillcolor="white", style="filled",URL="$_capabilities_delegate_8cpp.html"];
  Node5 -> Node7 [dir="back",color="midnightblue",fontsize="10",style="solid",fontname="Helvetica"];
  Node7 [label="/workplace/avs-device\l-sdk/CapabilitiesDelegate\l/test/CapabilitiesDelegateTest.cpp",height=0.2,width=0.4,color="black", fillcolor="white", style="filled",URL="$_capabilities_delegate_test_8cpp.html"];
  Node5 -> Node8 [dir="back",color="midnightblue",fontsize="10",style="solid",fontname="Helvetica"];
  Node8 [label="/workplace/avs-device\l-sdk/SampleApp/include\l/SampleApp/SampleApplication.h",height=0.2,width=0.4,color="black", fillcolor="white", style="filled",URL="$_sample_application_8h.html"];
  Node8 -> Node9 [dir="back",color="midnightblue",fontsize="10",style="solid",fontname="Helvetica"];
  Node9 [label="/workplace/avs-device\l-sdk/SampleApp/src/main.cpp",height=0.2,width=0.4,color="black", fillcolor="white", style="filled",URL="$main_8cpp.html"];
  Node8 -> Node10 [dir="back",color="midnightblue",fontsize="10",style="solid",fontname="Helvetica"];
  Node10 [label="/workplace/avs-device\l-sdk/SampleApp/src/SampleApplication.cpp",height=0.2,width=0.4,color="black", fillcolor="white", style="filled",URL="$_sample_application_8cpp.html"];
  Node5 -> Node10 [dir="back",color="midnightblue",fontsize="10",style="solid",fontname="Helvetica"];
  Node1 -> Node6 [dir="back",color="midnightblue",fontsize="10",style="solid",fontname="Helvetica"];
  Node1 -> Node11 [dir="back",color="midnightblue",fontsize="10",style="solid",fontname="Helvetica"];
  Node11 [label="/workplace/avs-device\l-sdk/CapabilitiesDelegate\l/test/Common/TestableMiscStorage.h",height=0.2,width=0.4,color="black", fillcolor="white", style="filled",URL="$_testable_misc_storage_8h.html"];
  Node11 -> Node7 [dir="back",color="midnightblue",fontsize="10",style="solid",fontname="Helvetica"];
  Node11 -> Node12 [dir="back",color="midnightblue",fontsize="10",style="solid",fontname="Helvetica"];
  Node12 [label="/workplace/avs-device\l-sdk/CapabilitiesDelegate\l/test/Common/TestableMiscStorage.cpp",height=0.2,width=0.4,color="black", fillcolor="white", style="filled",URL="$_testable_misc_storage_8cpp.html"];
  Node1 -> Node13 [dir="back",color="midnightblue",fontsize="10",style="solid",fontname="Helvetica"];
  Node13 [label="/workplace/avs-device\l-sdk/EqualizerImplementations\l/include/EqualizerImplementations\l/MiscDBEqualizerStorage.h",height=0.2,width=0.4,color="black", fillcolor="white", style="filled",URL="$_misc_d_b_equalizer_storage_8h.html"];
  Node13 -> Node14 [dir="back",color="midnightblue",fontsize="10",style="solid",fontname="Helvetica"];
  Node14 [label="/workplace/avs-device\l-sdk/EqualizerImplementations\l/src/MiscDBEqualizerStorage.cpp",height=0.2,width=0.4,color="black", fillcolor="white", style="filled",URL="$_misc_d_b_equalizer_storage_8cpp.html"];
  Node13 -> Node4 [dir="back",color="midnightblue",fontsize="10",style="solid",fontname="Helvetica"];
  Node13 -> Node10 [dir="back",color="midnightblue",fontsize="10",style="solid",fontname="Helvetica"];
  Node1 -> Node15 [dir="back",color="midnightblue",fontsize="10",style="solid",fontname="Helvetica"];
  Node15 [label="/workplace/avs-device\l-sdk/Storage/SQLiteStorage\l/include/SQLiteStorage/SQLiteMisc\lStorage.h",height=0.2,width=0.4,color="black", fillcolor="white", style="filled",URL="$_s_q_lite_misc_storage_8h.html"];
  Node15 -> Node10 [dir="back",color="midnightblue",fontsize="10",style="solid",fontname="Helvetica"];
  Node15 -> Node16 [dir="back",color="midnightblue",fontsize="10",style="solid",fontname="Helvetica"];
  Node16 [label="/workplace/avs-device\l-sdk/Storage/SQLiteStorage\l/src/SQLiteMiscStorage.cpp",height=0.2,width=0.4,color="black", fillcolor="white", style="filled",URL="$_s_q_lite_misc_storage_8cpp.html"];
  Node15 -> Node17 [dir="back",color="midnightblue",fontsize="10",style="solid",fontname="Helvetica"];
  Node17 [label="/workplace/avs-device\l-sdk/Storage/SQLiteStorage\l/test/SQLiteMiscStorageTest.cpp",height=0.2,width=0.4,color="black", fillcolor="white", style="filled",URL="$_s_q_lite_misc_storage_test_8cpp.html"];
}
