digraph "/workplace/avs-device-sdk/AVSCommon/SDKInterfaces/include/AVSCommon/SDKInterfaces/StateProviderInterface.h"
{
  edge [fontname="Helvetica",fontsize="10",labelfontname="Helvetica",labelfontsize="10"];
  node [fontname="Helvetica",fontsize="10",shape=record];
  Node1 [label="/workplace/avs-device\l-sdk/AVSCommon/SDKInterfaces\l/include/AVSCommon/SDKInterfaces\l/StateProviderInterface.h",height=0.2,width=0.4,color="black", fillcolor="grey75", style="filled", fontcolor="black"];
  Node1 -> Node2 [dir="back",color="midnightblue",fontsize="10",style="solid",fontname="Helvetica"];
  Node2 [label="/workplace/avs-device\l-sdk/AFML/include/AFML\l/AudioActivityTracker.h",height=0.2,width=0.4,color="black", fillcolor="white", style="filled",URL="$_audio_activity_tracker_8h.html"];
  Node2 -> Node3 [dir="back",color="midnightblue",fontsize="10",style="solid",fontname="Helvetica"];
  Node3 [label="/workplace/avs-device\l-sdk/AFML/src/AudioActivity\lTracker.cpp",height=0.2,width=0.4,color="black", fillcolor="white", style="filled",URL="$_audio_activity_tracker_8cpp.html"];
  Node2 -> Node4 [dir="back",color="midnightblue",fontsize="10",style="solid",fontname="Helvetica"];
  Node4 [label="/workplace/avs-device\l-sdk/AFML/test/AudioActivity\lTrackerTest.cpp",height=0.2,width=0.4,color="black", fillcolor="white", style="filled",URL="$_audio_activity_tracker_test_8cpp.html"];
  Node2 -> Node5 [dir="back",color="midnightblue",fontsize="10",style="solid",fontname="Helvetica"];
  Node5 [label="/workplace/avs-device\l-sdk/ApplicationUtilities\l/DefaultClient/include/DefaultClient\l/DefaultClient.h",height=0.2,width=0.4,color="black", fillcolor="white", style="filled",URL="$_default_client_8h.html"];
  Node5 -> Node6 [dir="back",color="midnightblue",fontsize="10",style="solid",fontname="Helvetica"];
  Node6 [label="/workplace/avs-device\l-sdk/ApplicationUtilities\l/DefaultClient/src/DefaultClient.cpp",height=0.2,width=0.4,color="black", fillcolor="white", style="filled",URL="$_default_client_8cpp.html"];
  Node5 -> Node7 [dir="back",color="midnightblue",fontsize="10",style="solid",fontname="Helvetica"];
  Node7 [label="/workplace/avs-device\l-sdk/SampleApp/include\l/SampleApp/InteractionManager.h",height=0.2,width=0.4,color="red", fillcolor="white", style="filled",URL="$_interaction_manager_8h.html"];
  Node5 -> Node8 [dir="back",color="midnightblue",fontsize="10",style="solid",fontname="Helvetica"];
  Node8 [label="/workplace/avs-device\l-sdk/SampleApp/include\l/SampleApp/KeywordObserver.h",height=0.2,width=0.4,color="red", fillcolor="white", style="filled",URL="$_keyword_observer_8h.html"];
  Node8 -> Node7 [dir="back",color="midnightblue",fontsize="10",style="solid",fontname="Helvetica"];
  Node8 -> Node9 [dir="back",color="midnightblue",fontsize="10",style="solid",fontname="Helvetica"];
  Node9 [label="/workplace/avs-device\l-sdk/SampleApp/src/SampleApplication.cpp",height=0.2,width=0.4,color="black", fillcolor="white", style="filled",URL="$_sample_application_8cpp.html"];
  Node1 -> Node10 [dir="back",color="midnightblue",fontsize="10",style="solid",fontname="Helvetica"];
  Node10 [label="/workplace/avs-device\l-sdk/AFML/include/AFML\l/VisualActivityTracker.h",height=0.2,width=0.4,color="black", fillcolor="white", style="filled",URL="$_visual_activity_tracker_8h.html"];
  Node10 -> Node11 [dir="back",color="midnightblue",fontsize="10",style="solid",fontname="Helvetica"];
  Node11 [label="/workplace/avs-device\l-sdk/AFML/src/VisualActivity\lTracker.cpp",height=0.2,width=0.4,color="black", fillcolor="white", style="filled",URL="$_visual_activity_tracker_8cpp.html"];
  Node10 -> Node12 [dir="back",color="midnightblue",fontsize="10",style="solid",fontname="Helvetica"];
  Node12 [label="/workplace/avs-device\l-sdk/AFML/test/VisualActivity\lTrackerTest.cpp",height=0.2,width=0.4,color="black", fillcolor="white", style="filled",URL="$_visual_activity_tracker_test_8cpp.html"];
  Node10 -> Node5 [dir="back",color="midnightblue",fontsize="10",style="solid",fontname="Helvetica"];
  Node1 -> Node13 [dir="back",color="midnightblue",fontsize="10",style="solid",fontname="Helvetica"];
  Node13 [label="/workplace/avs-device\l-sdk/AVSCommon/AVS/include\l/AVSCommon/AVS/CapabilityAgent.h",height=0.2,width=0.4,color="black", fillcolor="white", style="filled",URL="$_capability_agent_8h.html"];
  Node13 -> Node14 [dir="back",color="midnightblue",fontsize="10",style="solid",fontname="Helvetica"];
  Node14 [label="/workplace/avs-device\l-sdk/AVSCommon/AVS/src\l/CapabilityAgent.cpp",height=0.2,width=0.4,color="black", fillcolor="white", style="filled",URL="$_capability_agent_8cpp.html"];
  Node13 -> Node15 [dir="back",color="midnightblue",fontsize="10",style="solid",fontname="Helvetica"];
  Node15 [label="/workplace/avs-device\l-sdk/AVSCommon/AVS/test\l/CapabilityAgentTest.cpp",height=0.2,width=0.4,color="black", fillcolor="white", style="filled",URL="$_capability_agent_test_8cpp.html"];
  Node13 -> Node16 [dir="back",color="midnightblue",fontsize="10",style="solid",fontname="Helvetica"];
  Node16 [label="/workplace/avs-device\l-sdk/CapabilityAgents\l/AIP/include/AIP/AudioInputProcessor.h",height=0.2,width=0.4,color="red", fillcolor="white", style="filled",URL="$_audio_input_processor_8h.html"];
  Node16 -> Node5 [dir="back",color="midnightblue",fontsize="10",style="solid",fontname="Helvetica"];
  Node16 -> Node17 [dir="back",color="midnightblue",fontsize="10",style="solid",fontname="Helvetica"];
  Node17 [label="/workplace/avs-device\l-sdk/CapabilityAgents\l/AIP/src/AudioInputProcessor.cpp",height=0.2,width=0.4,color="black", fillcolor="white", style="filled",URL="$_audio_input_processor_8cpp.html"];
  Node16 -> Node18 [dir="back",color="midnightblue",fontsize="10",style="solid",fontname="Helvetica"];
  Node18 [label="/workplace/avs-device\l-sdk/CapabilityAgents\l/AIP/test/AudioInputProcessor\lTest.cpp",height=0.2,width=0.4,color="black", fillcolor="white", style="filled",URL="$_audio_input_processor_test_8cpp.html"];
  Node16 -> Node19 [dir="back",color="midnightblue",fontsize="10",style="solid",fontname="Helvetica"];
  Node19 [label="/workplace/avs-device\l-sdk/Integration/test\l/AlertsIntegrationTest.cpp",height=0.2,width=0.4,color="black", fillcolor="white", style="filled",URL="$_alerts_integration_test_8cpp.html"];
  Node16 -> Node20 [dir="back",color="midnightblue",fontsize="10",style="solid",fontname="Helvetica"];
  Node20 [label="/workplace/avs-device\l-sdk/Integration/test\l/AudioInputProcessorIntegration\lTest.cpp",height=0.2,width=0.4,color="black", fillcolor="white", style="filled",URL="$_audio_input_processor_integration_test_8cpp.html"];
  Node13 -> Node21 [dir="back",color="midnightblue",fontsize="10",style="solid",fontname="Helvetica"];
  Node21 [label="/workplace/avs-device\l-sdk/CapabilityAgents\l/Alerts/include/Alerts\l/AlertsCapabilityAgent.h",height=0.2,width=0.4,color="red", fillcolor="white", style="filled",URL="$_alerts_capability_agent_8h.html"];
  Node21 -> Node5 [dir="back",color="midnightblue",fontsize="10",style="solid",fontname="Helvetica"];
  Node21 -> Node19 [dir="back",color="midnightblue",fontsize="10",style="solid",fontname="Helvetica"];
  Node13 -> Node22 [dir="back",color="midnightblue",fontsize="10",style="solid",fontname="Helvetica"];
  Node22 [label="/workplace/avs-device\l-sdk/CapabilityAgents\l/AudioPlayer/include/AudioPlayer\l/AudioPlayer.h",height=0.2,width=0.4,color="red", fillcolor="white", style="filled",URL="$_audio_player_8h.html"];
  Node22 -> Node5 [dir="back",color="midnightblue",fontsize="10",style="solid",fontname="Helvetica"];
  Node13 -> Node23 [dir="back",color="midnightblue",fontsize="10",style="solid",fontname="Helvetica"];
  Node23 [label="/workplace/avs-device\l-sdk/CapabilityAgents\l/Bluetooth/include/Bluetooth\l/Bluetooth.h",height=0.2,width=0.4,color="red", fillcolor="white", style="filled",URL="$_bluetooth_8h.html"];
  Node23 -> Node5 [dir="back",color="midnightblue",fontsize="10",style="solid",fontname="Helvetica"];
  Node13 -> Node24 [dir="back",color="midnightblue",fontsize="10",style="solid",fontname="Helvetica"];
  Node24 [label="/workplace/avs-device\l-sdk/CapabilityAgents\l/DoNotDisturb/include\l/DoNotDisturbCA/DoNotDisturbCapability\lAgent.h",height=0.2,width=0.4,color="red", fillcolor="white", style="filled",URL="$_do_not_disturb_capability_agent_8h.html"];
  Node24 -> Node5 [dir="back",color="midnightblue",fontsize="10",style="solid",fontname="Helvetica"];
  Node13 -> Node25 [dir="back",color="midnightblue",fontsize="10",style="solid",fontname="Helvetica"];
  Node25 [label="/workplace/avs-device\l-sdk/CapabilityAgents\l/Equalizer/include/Equalizer\l/EqualizerCapabilityAgent.h",height=0.2,width=0.4,color="red", fillcolor="white", style="filled",URL="$_equalizer_capability_agent_8h.html"];
  Node25 -> Node5 [dir="back",color="midnightblue",fontsize="10",style="solid",fontname="Helvetica"];
  Node13 -> Node26 [dir="back",color="midnightblue",fontsize="10",style="solid",fontname="Helvetica"];
  Node26 [label="/workplace/avs-device\l-sdk/CapabilityAgents\l/ExternalMediaPlayer/include\l/ExternalMediaPlayer/ExternalMedia\lPlayer.h",height=0.2,width=0.4,color="red", fillcolor="white", style="filled",URL="$_external_media_player_8h.html"];
  Node26 -> Node5 [dir="back",color="midnightblue",fontsize="10",style="solid",fontname="Helvetica"];
  Node13 -> Node27 [dir="back",color="midnightblue",fontsize="10",style="solid",fontname="Helvetica"];
  Node27 [label="/workplace/avs-device\l-sdk/CapabilityAgents\l/InteractionModel/include\l/InteractionModel/InteractionModel\lCapabilityAgent.h",height=0.2,width=0.4,color="red", fillcolor="white", style="filled",URL="$_interaction_model_capability_agent_8h.html"];
  Node27 -> Node5 [dir="back",color="midnightblue",fontsize="10",style="solid",fontname="Helvetica"];
  Node13 -> Node28 [dir="back",color="midnightblue",fontsize="10",style="solid",fontname="Helvetica"];
  Node28 [label="/workplace/avs-device\l-sdk/CapabilityAgents\l/MRM/include/MRM/MRMCapability\lAgent.h",height=0.2,width=0.4,color="red", fillcolor="white", style="filled",URL="$_m_r_m_capability_agent_8h.html"];
  Node28 -> Node5 [dir="back",color="midnightblue",fontsize="10",style="solid",fontname="Helvetica"];
  Node13 -> Node29 [dir="back",color="midnightblue",fontsize="10",style="solid",fontname="Helvetica"];
  Node29 [label="/workplace/avs-device\l-sdk/CapabilityAgents\l/Notifications/include\l/Notifications/NotificationsCapability\lAgent.h",height=0.2,width=0.4,color="red", fillcolor="white", style="filled",URL="$_notifications_capability_agent_8h.html"];
  Node29 -> Node5 [dir="back",color="midnightblue",fontsize="10",style="solid",fontname="Helvetica"];
  Node13 -> Node30 [dir="back",color="midnightblue",fontsize="10",style="solid",fontname="Helvetica"];
  Node30 [label="/workplace/avs-device\l-sdk/CapabilityAgents\l/SpeakerManager/include\l/SpeakerManager/SpeakerManager.h",height=0.2,width=0.4,color="red", fillcolor="white", style="filled",URL="$_speaker_manager_8h.html"];
  Node30 -> Node5 [dir="back",color="midnightblue",fontsize="10",style="solid",fontname="Helvetica"];
  Node13 -> Node31 [dir="back",color="midnightblue",fontsize="10",style="solid",fontname="Helvetica"];
  Node31 [label="/workplace/avs-device\l-sdk/CapabilityAgents\l/SpeechSynthesizer/include\l/SpeechSynthesizer/SpeechSynthesizer.h",height=0.2,width=0.4,color="red", fillcolor="white", style="filled",URL="$_speech_synthesizer_8h.html"];
  Node31 -> Node5 [dir="back",color="midnightblue",fontsize="10",style="solid",fontname="Helvetica"];
  Node31 -> Node19 [dir="back",color="midnightblue",fontsize="10",style="solid",fontname="Helvetica"];
  Node13 -> Node32 [dir="back",color="midnightblue",fontsize="10",style="solid",fontname="Helvetica"];
  Node32 [label="/workplace/avs-device\l-sdk/CapabilityAgents\l/System/include/System\l/EndpointHandler.h",height=0.2,width=0.4,color="red", fillcolor="white", style="filled",URL="$_endpoint_handler_8h.html"];
  Node32 -> Node6 [dir="back",color="midnightblue",fontsize="10",style="solid",fontname="Helvetica"];
  Node13 -> Node33 [dir="back",color="midnightblue",fontsize="10",style="solid",fontname="Helvetica"];
  Node33 [label="/workplace/avs-device\l-sdk/CapabilityAgents\l/System/include/System\l/RevokeAuthorizationHandler.h",height=0.2,width=0.4,color="red", fillcolor="white", style="filled",URL="$_revoke_authorization_handler_8h.html"];
  Node13 -> Node34 [dir="back",color="midnightblue",fontsize="10",style="solid",fontname="Helvetica"];
  Node34 [label="/workplace/avs-device\l-sdk/CapabilityAgents\l/System/include/System\l/SoftwareInfoSender.h",height=0.2,width=0.4,color="red", fillcolor="white", style="filled",URL="$_software_info_sender_8h.html"];
  Node34 -> Node5 [dir="back",color="midnightblue",fontsize="10",style="solid",fontname="Helvetica"];
  Node13 -> Node35 [dir="back",color="midnightblue",fontsize="10",style="solid",fontname="Helvetica"];
  Node35 [label="/workplace/avs-device\l-sdk/CapabilityAgents\l/System/include/System\l/UserInactivityMonitor.h",height=0.2,width=0.4,color="red", fillcolor="white", style="filled",URL="$_user_inactivity_monitor_8h.html"];
  Node35 -> Node5 [dir="back",color="midnightblue",fontsize="10",style="solid",fontname="Helvetica"];
  Node35 -> Node6 [dir="back",color="midnightblue",fontsize="10",style="solid",fontname="Helvetica"];
  Node35 -> Node19 [dir="back",color="midnightblue",fontsize="10",style="solid",fontname="Helvetica"];
  Node35 -> Node20 [dir="back",color="midnightblue",fontsize="10",style="solid",fontname="Helvetica"];
  Node13 -> Node36 [dir="back",color="midnightblue",fontsize="10",style="solid",fontname="Helvetica"];
  Node36 [label="/workplace/avs-device\l-sdk/CapabilityAgents\l/TemplateRuntime/include\l/TemplateRuntime/TemplateRuntime.h",height=0.2,width=0.4,color="red", fillcolor="white", style="filled",URL="$_template_runtime_8h.html"];
  Node36 -> Node5 [dir="back",color="midnightblue",fontsize="10",style="solid",fontname="Helvetica"];
  Node1 -> Node37 [dir="back",color="midnightblue",fontsize="10",style="solid",fontname="Helvetica"];
  Node37 [label="/workplace/avs-device\l-sdk/AVSCommon/SDKInterfaces\l/include/AVSCommon/SDKInterfaces\l/ContextManagerInterface.h",height=0.2,width=0.4,color="black", fillcolor="white", style="filled",URL="$_context_manager_interface_8h.html"];
  Node37 -> Node38 [dir="back",color="midnightblue",fontsize="10",style="solid",fontname="Helvetica"];
  Node38 [label="/workplace/avs-device\l-sdk/ACL/include/ACL\l/Transport/PostConnectSynchronizer.h",height=0.2,width=0.4,color="red", fillcolor="white", style="filled",URL="$_post_connect_synchronizer_8h.html"];
  Node38 -> Node5 [dir="back",color="midnightblue",fontsize="10",style="solid",fontname="Helvetica"];
  Node38 -> Node9 [dir="back",color="midnightblue",fontsize="10",style="solid",fontname="Helvetica"];
  Node37 -> Node39 [dir="back",color="midnightblue",fontsize="10",style="solid",fontname="Helvetica"];
  Node39 [label="/workplace/avs-device\l-sdk/ACL/include/ACL\l/Transport/PostConnectSynchronizer\lFactory.h",height=0.2,width=0.4,color="red", fillcolor="white", style="filled",URL="$_post_connect_synchronizer_factory_8h.html"];
  Node39 -> Node5 [dir="back",color="midnightblue",fontsize="10",style="solid",fontname="Helvetica"];
  Node39 -> Node40 [dir="back",color="midnightblue",fontsize="10",style="solid",fontname="Helvetica"];
  Node40 [label="/workplace/avs-device\l-sdk/Integration/test\l/ServerDisconnectIntegration\lTest.cpp",height=0.2,width=0.4,color="black", fillcolor="white", style="filled",URL="$_server_disconnect_integration_test_8cpp.html"];
  Node37 -> Node2 [dir="back",color="midnightblue",fontsize="10",style="solid",fontname="Helvetica"];
  Node37 -> Node10 [dir="back",color="midnightblue",fontsize="10",style="solid",fontname="Helvetica"];
  Node37 -> Node41 [dir="back",color="midnightblue",fontsize="10",style="solid",fontname="Helvetica"];
  Node41 [label="/workplace/avs-device\l-sdk/AVSCommon/SDKInterfaces\l/include/AVSCommon/SDKInterfaces\l/ExternalMediaPlayerInterface.h",height=0.2,width=0.4,color="black", fillcolor="white", style="filled",URL="$_external_media_player_interface_8h.html"];
  Node41 -> Node26 [dir="back",color="midnightblue",fontsize="10",style="solid",fontname="Helvetica"];
  Node37 -> Node42 [dir="back",color="midnightblue",fontsize="10",style="solid",fontname="Helvetica"];
  Node42 [label="/workplace/avs-device\l-sdk/AVSCommon/SDKInterfaces\l/test/AVSCommon/SDKInterfaces\l/MockContextManager.h",height=0.2,width=0.4,color="red", fillcolor="white", style="filled",URL="$_mock_context_manager_8h.html"];
  Node42 -> Node4 [dir="back",color="midnightblue",fontsize="10",style="solid",fontname="Helvetica"];
  Node42 -> Node12 [dir="back",color="midnightblue",fontsize="10",style="solid",fontname="Helvetica"];
  Node42 -> Node18 [dir="back",color="midnightblue",fontsize="10",style="solid",fontname="Helvetica"];
  Node37 -> Node16 [dir="back",color="midnightblue",fontsize="10",style="solid",fontname="Helvetica"];
  Node37 -> Node21 [dir="back",color="midnightblue",fontsize="10",style="solid",fontname="Helvetica"];
  Node37 -> Node22 [dir="back",color="midnightblue",fontsize="10",style="solid",fontname="Helvetica"];
  Node37 -> Node23 [dir="back",color="midnightblue",fontsize="10",style="solid",fontname="Helvetica"];
  Node37 -> Node25 [dir="back",color="midnightblue",fontsize="10",style="solid",fontname="Helvetica"];
  Node37 -> Node26 [dir="back",color="midnightblue",fontsize="10",style="solid",fontname="Helvetica"];
  Node37 -> Node28 [dir="back",color="midnightblue",fontsize="10",style="solid",fontname="Helvetica"];
  Node37 -> Node29 [dir="back",color="midnightblue",fontsize="10",style="solid",fontname="Helvetica"];
  Node37 -> Node43 [dir="back",color="midnightblue",fontsize="10",style="solid",fontname="Helvetica"];
  Node43 [label="/workplace/avs-device\l-sdk/CapabilityAgents\l/PlaybackController/include\l/PlaybackController/PlaybackController.h",height=0.2,width=0.4,color="red", fillcolor="white", style="filled",URL="$_playback_controller_8h.html"];
  Node43 -> Node5 [dir="back",color="midnightblue",fontsize="10",style="solid",fontname="Helvetica"];
  Node37 -> Node30 [dir="back",color="midnightblue",fontsize="10",style="solid",fontname="Helvetica"];
  Node37 -> Node31 [dir="back",color="midnightblue",fontsize="10",style="solid",fontname="Helvetica"];
  Node37 -> Node44 [dir="back",color="midnightblue",fontsize="10",style="solid",fontname="Helvetica"];
  Node44 [label="/workplace/avs-device\l-sdk/ContextManager/include\l/ContextManager/ContextManager.h",height=0.2,width=0.4,color="black", fillcolor="white", style="filled",URL="$_context_manager_8h.html"];
  Node44 -> Node45 [dir="back",color="midnightblue",fontsize="10",style="solid",fontname="Helvetica"];
  Node45 [label="/workplace/avs-device\l-sdk/ContextManager/src\l/ContextManager.cpp",height=0.2,width=0.4,color="black", fillcolor="white", style="filled",URL="$_context_manager_8cpp.html"];
  Node44 -> Node46 [dir="back",color="midnightblue",fontsize="10",style="solid",fontname="Helvetica"];
  Node46 [label="/workplace/avs-device\l-sdk/ContextManager/test\l/ContextManagerTest.cpp",height=0.2,width=0.4,color="black", fillcolor="white", style="filled",URL="$_context_manager_test_8cpp.html"];
  Node44 -> Node47 [dir="back",color="midnightblue",fontsize="10",style="solid",fontname="Helvetica"];
  Node47 [label="/workplace/avs-device\l-sdk/Integration/include\l/Integration/ACLTestContext.h",height=0.2,width=0.4,color="red", fillcolor="white", style="filled",URL="$_a_c_l_test_context_8h.html"];
  Node47 -> Node19 [dir="back",color="midnightblue",fontsize="10",style="solid",fontname="Helvetica"];
  Node47 -> Node48 [dir="back",color="midnightblue",fontsize="10",style="solid",fontname="Helvetica"];
  Node48 [label="/workplace/avs-device\l-sdk/Integration/test\l/AlexaCommunicationsLibraryTest.cpp",height=0.2,width=0.4,color="black", fillcolor="white", style="filled",URL="$_alexa_communications_library_test_8cpp.html"];
  Node47 -> Node20 [dir="back",color="midnightblue",fontsize="10",style="solid",fontname="Helvetica"];
  Node47 -> Node49 [dir="back",color="midnightblue",fontsize="10",style="solid",fontname="Helvetica"];
  Node49 [label="/workplace/avs-device\l-sdk/Integration/test\l/NetworkIntegrationTests.cpp",height=0.2,width=0.4,color="black", fillcolor="white", style="filled",URL="$_network_integration_tests_8cpp.html"];
  Node44 -> Node50 [dir="back",color="midnightblue",fontsize="10",style="solid",fontname="Helvetica"];
  Node50 [label="/workplace/avs-device\l-sdk/Integration/include\l/Integration/AuthDelegateTestContext.h",height=0.2,width=0.4,color="red", fillcolor="white", style="filled",URL="$_auth_delegate_test_context_8h.html"];
  Node50 -> Node47 [dir="back",color="midnightblue",fontsize="10",style="solid",fontname="Helvetica"];
  Node50 -> Node40 [dir="back",color="midnightblue",fontsize="10",style="solid",fontname="Helvetica"];
  Node44 -> Node48 [dir="back",color="midnightblue",fontsize="10",style="solid",fontname="Helvetica"];
  Node44 -> Node49 [dir="back",color="midnightblue",fontsize="10",style="solid",fontname="Helvetica"];
  Node44 -> Node40 [dir="back",color="midnightblue",fontsize="10",style="solid",fontname="Helvetica"];
  Node44 -> Node9 [dir="back",color="midnightblue",fontsize="10",style="solid",fontname="Helvetica"];
  Node1 -> Node44 [dir="back",color="midnightblue",fontsize="10",style="solid",fontname="Helvetica"];
}
