digraph "alexaClientSDK::avsCommon::utils::playlistParser::PlaylistEntry"
{
  edge [fontname="Helvetica",fontsize="10",labelfontname="Helvetica",labelfontsize="10"];
  node [fontname="Helvetica",fontsize="10",shape=record];
  Node1 [label="alexaClientSDK::avsCommon\l::utils::playlistParser\l::PlaylistEntry",height=0.2,width=0.4,color="black", fillcolor="grey75", style="filled", fontcolor="black"];
  Node2 -> Node1 [dir="back",color="darkorchid3",fontsize="10",style="dashed",label=" encryptionInfo" ,fontname="Helvetica"];
  Node2 [label="alexaClientSDK::avsCommon\l::utils::playlistParser\l::EncryptionInfo",height=0.2,width=0.4,color="black", fillcolor="white", style="filled",URL="$structalexa_client_s_d_k_1_1avs_common_1_1utils_1_1playlist_parser_1_1_encryption_info.html"];
}
