digraph "/workplace/avs-device-sdk/CapabilitiesDelegate/test/Common/TestableCapabilityProvider.h"
{
  edge [fontname="Helvetica",fontsize="10",labelfontname="Helvetica",labelfontsize="10"];
  node [fontname="Helvetica",fontsize="10",shape=record];
  Node1 [label="/workplace/avs-device\l-sdk/CapabilitiesDelegate\l/test/Common/TestableCapability\lProvider.h",height=0.2,width=0.4,color="black", fillcolor="grey75", style="filled", fontcolor="black"];
  Node1 -> Node2 [dir="back",color="midnightblue",fontsize="10",style="solid",fontname="Helvetica"];
  Node2 [label="/workplace/avs-device\l-sdk/CapabilitiesDelegate\l/test/CapabilitiesDelegateTest.cpp",height=0.2,width=0.4,color="black", fillcolor="white", style="filled",URL="$_capabilities_delegate_test_8cpp.html"];
  Node1 -> Node3 [dir="back",color="midnightblue",fontsize="10",style="solid",fontname="Helvetica"];
  Node3 [label="/workplace/avs-device\l-sdk/CapabilitiesDelegate\l/test/Common/TestableCapability\lProvider.cpp",height=0.2,width=0.4,color="black", fillcolor="white", style="filled",URL="$_testable_capability_provider_8cpp.html"];
}
