digraph "/workplace/avs-device-sdk/MediaPlayer/GStreamerMediaPlayer/include/MediaPlayer/MediaPlayer.h"
{
  edge [fontname="Helvetica",fontsize="10",labelfontname="Helvetica",labelfontsize="10"];
  node [fontname="Helvetica",fontsize="10",shape=record];
  Node1 [label="/workplace/avs-device\l-sdk/MediaPlayer/GStreamerMedia\lPlayer/include/MediaPlayer\l/MediaPlayer.h",height=0.2,width=0.4,color="black", fillcolor="grey75", style="filled", fontcolor="black"];
  Node1 -> Node2 [dir="back",color="midnightblue",fontsize="10",style="solid",fontname="Helvetica"];
  Node2 [label="/workplace/avs-device\l-sdk/MediaPlayer/GStreamerMedia\lPlayer/src/MediaPlayer.cpp",height=0.2,width=0.4,color="black", fillcolor="white", style="filled",URL="$_media_player_8cpp.html"];
  Node1 -> Node3 [dir="back",color="midnightblue",fontsize="10",style="solid",fontname="Helvetica"];
  Node3 [label="/workplace/avs-device\l-sdk/MediaPlayer/GStreamerMedia\lPlayer/test/MediaPlayerTest.cpp",height=0.2,width=0.4,color="black", fillcolor="white", style="filled",URL="$_media_player_test_8cpp.html"];
}
