digraph "/workplace/avs-device-sdk/ACL/src" {
  compound=true
  node [ fontsize="10", fontname="Helvetica"];
  edge [ labelfontsize="10", labelfontname="Helvetica"];
  subgraph clusterdir_b1dfedc9efa610ba8c818c30206ff41f {
    graph [ bgcolor="#ddddee", pencolor="black", label="ACL" fontname="Helvetica", fontsize="10", URL="dir_b1dfedc9efa610ba8c818c30206ff41f.html"]
  subgraph clusterdir_b7bc15c7de8e43583c698b7747a94971 {
    graph [ bgcolor="#eeeeff", pencolor="black", label="" URL="dir_b7bc15c7de8e43583c698b7747a94971.html"];
    dir_b7bc15c7de8e43583c698b7747a94971 [shape=plaintext label="src"];
    dir_7cc4805d13c57da402acac8e1a9ae866 [shape=box label="Transport" color="black" fillcolor="white" style="filled" URL="dir_7cc4805d13c57da402acac8e1a9ae866.html"];
  }
  }
  dir_13e65effb2bde530b17b3d5eefcd0266 [shape=box label="AVSCommon" fillcolor="white" style="filled" color="red" URL="dir_13e65effb2bde530b17b3d5eefcd0266.html"];
  dir_1088b026815130b3cc8e9ac3f4525272 [shape=box label="include" fillcolor="white" style="filled" color="red" URL="dir_1088b026815130b3cc8e9ac3f4525272.html"];
  dir_b7bc15c7de8e43583c698b7747a94971->dir_13e65effb2bde530b17b3d5eefcd0266 [headlabel="27", labeldistance=1.5 headhref="dir_000004_000015.html"];
  dir_b7bc15c7de8e43583c698b7747a94971->dir_1088b026815130b3cc8e9ac3f4525272 [headlabel="29", labeldistance=1.5 headhref="dir_000004_000001.html"];
  dir_7cc4805d13c57da402acac8e1a9ae866->dir_13e65effb2bde530b17b3d5eefcd0266 [headlabel="24", labeldistance=1.5 headhref="dir_000005_000015.html"];
  dir_7cc4805d13c57da402acac8e1a9ae866->dir_1088b026815130b3cc8e9ac3f4525272 [headlabel="27", labeldistance=1.5 headhref="dir_000005_000001.html"];
  dir_1088b026815130b3cc8e9ac3f4525272->dir_13e65effb2bde530b17b3d5eefcd0266 [headlabel="47", labeldistance=1.5 headhref="dir_000001_000015.html"];
}
