digraph "/workplace/avs-device-sdk/BluetoothImplementations/BlueZ/include/BlueZ/MediaContext.h"
{
  edge [fontname="Helvetica",fontsize="10",labelfontname="Helvetica",labelfontsize="10"];
  node [fontname="Helvetica",fontsize="10",shape=record];
  Node1 [label="/workplace/avs-device\l-sdk/BluetoothImplementations\l/BlueZ/include/BlueZ/MediaContext.h",height=0.2,width=0.4,color="black", fillcolor="grey75", style="filled", fontcolor="black"];
  Node1 -> Node2 [dir="back",color="midnightblue",fontsize="10",style="solid",fontname="Helvetica"];
  Node2 [label="/workplace/avs-device\l-sdk/BluetoothImplementations\l/BlueZ/include/BlueZ/MediaEndpoint.h",height=0.2,width=0.4,color="black", fillcolor="white", style="filled",URL="$_media_endpoint_8h.html"];
  Node2 -> Node3 [dir="back",color="midnightblue",fontsize="10",style="solid",fontname="Helvetica"];
  Node3 [label="/workplace/avs-device\l-sdk/BluetoothImplementations\l/BlueZ/src/BlueZA2DPSource.cpp",height=0.2,width=0.4,color="black", fillcolor="white", style="filled",URL="$_blue_z_a2_d_p_source_8cpp.html"];
  Node2 -> Node4 [dir="back",color="midnightblue",fontsize="10",style="solid",fontname="Helvetica"];
  Node4 [label="/workplace/avs-device\l-sdk/BluetoothImplementations\l/BlueZ/src/BlueZDeviceManager.cpp",height=0.2,width=0.4,color="black", fillcolor="white", style="filled",URL="$_blue_z_device_manager_8cpp.html"];
  Node2 -> Node5 [dir="back",color="midnightblue",fontsize="10",style="solid",fontname="Helvetica"];
  Node5 [label="/workplace/avs-device\l-sdk/BluetoothImplementations\l/BlueZ/src/MediaEndpoint.cpp",height=0.2,width=0.4,color="black", fillcolor="white", style="filled",URL="$_media_endpoint_8cpp.html"];
  Node1 -> Node6 [dir="back",color="midnightblue",fontsize="10",style="solid",fontname="Helvetica"];
  Node6 [label="/workplace/avs-device\l-sdk/BluetoothImplementations\l/BlueZ/src/MediaContext.cpp",height=0.2,width=0.4,color="black", fillcolor="white", style="filled",URL="$_media_context_8cpp.html"];
}
