digraph "alexaClientSDK::avsCommon::utils::bluetooth::BluetoothDeviceManagerInitializedEvent"
{
  edge [fontname="Helvetica",fontsize="10",labelfontname="Helvetica",labelfontsize="10"];
  node [fontname="Helvetica",fontsize="10",shape=record];
  Node1 [label="alexaClientSDK::avsCommon\l::utils::bluetooth::BluetoothDevice\lManagerInitializedEvent",height=0.2,width=0.4,color="black", fillcolor="grey75", style="filled", fontcolor="black"];
  Node2 -> Node1 [dir="back",color="midnightblue",fontsize="10",style="solid",fontname="Helvetica"];
  Node2 [label="alexaClientSDK::avsCommon\l::utils::bluetooth::BluetoothEvent",height=0.2,width=0.4,color="black", fillcolor="white", style="filled",URL="$classalexa_client_s_d_k_1_1avs_common_1_1utils_1_1bluetooth_1_1_bluetooth_event.html",tooltip="Base class for a BluetoothEvent. "];
}
