digraph "alexaClientSDK::avsCommon::utils::http2::HTTP2ConnectionFactoryInterface"
{
  edge [fontname="Helvetica",fontsize="10",labelfontname="Helvetica",labelfontsize="10"];
  node [fontname="Helvetica",fontsize="10",shape=record];
  Node1 [label="alexaClientSDK::avsCommon\l::utils::http2::HTTP2Connection\lFactoryInterface",height=0.2,width=0.4,color="black", fillcolor="grey75", style="filled", fontcolor="black"];
  Node1 -> Node2 [dir="back",color="midnightblue",fontsize="10",style="solid",fontname="Helvetica"];
  Node2 [label="alexaClientSDK::avsCommon\l::utils::libcurlUtils::\lLibcurlHTTP2ConnectionFactory",height=0.2,width=0.4,color="black", fillcolor="white", style="filled",URL="$classalexa_client_s_d_k_1_1avs_common_1_1utils_1_1libcurl_utils_1_1_libcurl_h_t_t_p2_connection_factory.html"];
}
