digraph "Graphical Class Hierarchy"
{
  edge [fontname="Helvetica",fontsize="10",labelfontname="Helvetica",labelfontsize="10"];
  node [fontname="Helvetica",fontsize="10",shape=record];
  rankdir="LR";
  Node1 [label="alexaClientSDK::application\lUtilities::androidUtilities\l::test::MockInterface",height=0.2,width=0.4,color="black", fillcolor="white", style="filled",URL="$classalexa_client_s_d_k_1_1application_utilities_1_1android_utilities_1_1test_1_1_mock_interface.html"];
  Node1 -> Node2 [dir="back",color="midnightblue",fontsize="10",style="solid",fontname="Helvetica"];
  Node2 [label="alexaClientSDK::application\lUtilities::androidUtilities\l::test::MockInterfaceImpl\<\l InterfaceT \>",height=0.2,width=0.4,color="black", fillcolor="white", style="filled",URL="$classalexa_client_s_d_k_1_1application_utilities_1_1android_utilities_1_1test_1_1_mock_interface_impl.html"];
}
