digraph "alexaClientSDK::acl::TransportDefines"
{
  edge [fontname="Helvetica",fontsize="10",labelfontname="Helvetica",labelfontsize="10"];
  node [fontname="Helvetica",fontsize="10",shape=record];
  Node1 [label="alexaClientSDK::acl\l::TransportDefines",height=0.2,width=0.4,color="black", fillcolor="grey75", style="filled", fontcolor="black"];
  Node2 -> Node1 [dir="back",color="darkorchid3",fontsize="10",style="dashed",label=" RETRY_TIMER" ,fontname="Helvetica"];
  Node2 [label="alexaClientSDK::avsCommon\l::utils::RetryTimer",height=0.2,width=0.4,color="black", fillcolor="white", style="filled",URL="$classalexa_client_s_d_k_1_1avs_common_1_1utils_1_1_retry_timer.html"];
}
