digraph "alexaClientSDK::avsCommon::sdkInterfaces::bluetooth::services::BluetoothServiceInterface"
{
  edge [fontname="Helvetica",fontsize="10",labelfontname="Helvetica",labelfontsize="10"];
  node [fontname="Helvetica",fontsize="10",shape=record];
  rankdir="LR";
  Node1 [label="alexaClientSDK::avsCommon\l::sdkInterfaces::bluetooth\l::services::BluetoothServiceInterface",height=0.2,width=0.4,color="black", fillcolor="grey75", style="filled", fontcolor="black"];
  Node1 -> Node2 [dir="back",color="midnightblue",fontsize="10",style="solid",fontname="Helvetica"];
  Node2 [label="alexaClientSDK::avsCommon\l::sdkInterfaces::bluetooth\l::services::A2DPSinkInterface",height=0.2,width=0.4,color="black", fillcolor="white", style="filled",URL="$classalexa_client_s_d_k_1_1avs_common_1_1sdk_interfaces_1_1bluetooth_1_1services_1_1_a2_d_p_sink_interface.html"];
  Node2 -> Node3 [dir="back",color="midnightblue",fontsize="10",style="solid",fontname="Helvetica"];
  Node3 [label="alexaClientSDK::bluetooth\lImplementations::blueZ\l::BlueZA2DPSink",height=0.2,width=0.4,color="black", fillcolor="white", style="filled",URL="$classalexa_client_s_d_k_1_1bluetooth_implementations_1_1blue_z_1_1_blue_z_a2_d_p_sink.html"];
  Node1 -> Node4 [dir="back",color="midnightblue",fontsize="10",style="solid",fontname="Helvetica"];
  Node4 [label="alexaClientSDK::avsCommon\l::sdkInterfaces::bluetooth\l::services::A2DPSourceInterface",height=0.2,width=0.4,color="black", fillcolor="white", style="filled",URL="$classalexa_client_s_d_k_1_1avs_common_1_1sdk_interfaces_1_1bluetooth_1_1services_1_1_a2_d_p_source_interface.html"];
  Node4 -> Node5 [dir="back",color="midnightblue",fontsize="10",style="solid",fontname="Helvetica"];
  Node5 [label="alexaClientSDK::bluetooth\lImplementations::blueZ\l::BlueZA2DPSource",height=0.2,width=0.4,color="black", fillcolor="white", style="filled",URL="$classalexa_client_s_d_k_1_1bluetooth_implementations_1_1blue_z_1_1_blue_z_a2_d_p_source.html"];
  Node1 -> Node6 [dir="back",color="midnightblue",fontsize="10",style="solid",fontname="Helvetica"];
  Node6 [label="alexaClientSDK::avsCommon\l::sdkInterfaces::bluetooth\l::services::AVRCPControllerInterface",height=0.2,width=0.4,color="black", fillcolor="white", style="filled",URL="$classalexa_client_s_d_k_1_1avs_common_1_1sdk_interfaces_1_1bluetooth_1_1services_1_1_a_v_r_c_p_controller_interface.html",tooltip="Used to implement an instance of AVRCPController (Audio/Video Remote Control Profile). "];
  Node6 -> Node7 [dir="back",color="midnightblue",fontsize="10",style="solid",fontname="Helvetica"];
  Node7 [label="alexaClientSDK::bluetooth\lImplementations::blueZ\l::BlueZAVRCPController",height=0.2,width=0.4,color="black", fillcolor="white", style="filled",URL="$classalexa_client_s_d_k_1_1bluetooth_implementations_1_1blue_z_1_1_blue_z_a_v_r_c_p_controller.html"];
  Node1 -> Node8 [dir="back",color="midnightblue",fontsize="10",style="solid",fontname="Helvetica"];
  Node8 [label="alexaClientSDK::avsCommon\l::sdkInterfaces::bluetooth\l::services::AVRCPTargetInterface",height=0.2,width=0.4,color="black", fillcolor="white", style="filled",URL="$classalexa_client_s_d_k_1_1avs_common_1_1sdk_interfaces_1_1bluetooth_1_1services_1_1_a_v_r_c_p_target_interface.html",tooltip="Used to implement an instance of AVRCPTarget (Audio/Video Remote Control Profile). "];
  Node8 -> Node9 [dir="back",color="midnightblue",fontsize="10",style="solid",fontname="Helvetica"];
  Node9 [label="alexaClientSDK::bluetooth\lImplementations::blueZ\l::BlueZAVRCPTarget",height=0.2,width=0.4,color="black", fillcolor="white", style="filled",URL="$classalexa_client_s_d_k_1_1bluetooth_implementations_1_1blue_z_1_1_blue_z_a_v_r_c_p_target.html",tooltip="A BlueZ implementation of the AVRCPTargetInterface. "];
}
