digraph "/workplace/avs-device-sdk/KWD/include/KWD" {
  compound=true
  node [ fontsize="10", fontname="Helvetica"];
  edge [ labelfontsize="10", labelfontname="Helvetica"];
  subgraph clusterdir_8dea89c1bb4f7e14d42e016f897bd2de {
    graph [ bgcolor="#ddddee", pencolor="black", label="include" fontname="Helvetica", fontsize="10", URL="dir_8dea89c1bb4f7e14d42e016f897bd2de.html"]
  dir_ebdf99d72507758dd36f6f35ec8f7330 [shape=box, label="KWD", style="filled", fillcolor="#eeeeff", pencolor="black", URL="dir_ebdf99d72507758dd36f6f35ec8f7330.html"];
  }
  dir_13e65effb2bde530b17b3d5eefcd0266 [shape=box label="AVSCommon" fillcolor="white" style="filled" color="red" URL="dir_13e65effb2bde530b17b3d5eefcd0266.html"];
  dir_ebdf99d72507758dd36f6f35ec8f7330->dir_13e65effb2bde530b17b3d5eefcd0266 [headlabel="4", labeldistance=1.5 headhref="dir_000237_000015.html"];
}
