digraph "/workplace/avs-device-sdk/AVSCommon/SDKInterfaces/include" {
  compound=true
  node [ fontsize="10", fontname="Helvetica"];
  edge [ labelfontsize="10", labelfontname="Helvetica"];
  subgraph clusterdir_97afc8111b754cf401b73024f872f45d {
    graph [ bgcolor="#ddddee", pencolor="black", label="SDKInterfaces" fontname="Helvetica", fontsize="10", URL="dir_97afc8111b754cf401b73024f872f45d.html"]
  subgraph clusterdir_17341252d14ec499eb3e1f7903ffcdf5 {
    graph [ bgcolor="#eeeeff", pencolor="black", label="" URL="dir_17341252d14ec499eb3e1f7903ffcdf5.html"];
    dir_17341252d14ec499eb3e1f7903ffcdf5 [shape=plaintext label="include"];
    dir_5021e1325decff0a465f80b9ba997f55 [shape=box label="AVSCommon" color="red" fillcolor="white" style="filled" URL="dir_5021e1325decff0a465f80b9ba997f55.html"];
  }
  }
  dir_80711c2a226d5fced33fce22558d3784 [shape=box label="AVS" fillcolor="white" style="filled" color="red" URL="dir_80711c2a226d5fced33fce22558d3784.html"];
  dir_49dd3d9ac5586189aa170bac46425b9c [shape=box label="Utils" fillcolor="white" style="filled" color="red" URL="dir_49dd3d9ac5586189aa170bac46425b9c.html"];
  dir_80711c2a226d5fced33fce22558d3784->dir_49dd3d9ac5586189aa170bac46425b9c [headlabel="44", labeldistance=1.5 headhref="dir_000043_000061.html"];
  dir_80711c2a226d5fced33fce22558d3784->dir_5021e1325decff0a465f80b9ba997f55 [headlabel="20", labeldistance=1.5 headhref="dir_000043_000071.html"];
  dir_49dd3d9ac5586189aa170bac46425b9c->dir_80711c2a226d5fced33fce22558d3784 [headlabel="10", labeldistance=1.5 headhref="dir_000061_000043.html"];
  dir_49dd3d9ac5586189aa170bac46425b9c->dir_5021e1325decff0a465f80b9ba997f55 [headlabel="18", labeldistance=1.5 headhref="dir_000061_000071.html"];
  dir_5021e1325decff0a465f80b9ba997f55->dir_80711c2a226d5fced33fce22558d3784 [headlabel="18", labeldistance=1.5 headhref="dir_000071_000043.html"];
  dir_5021e1325decff0a465f80b9ba997f55->dir_49dd3d9ac5586189aa170bac46425b9c [headlabel="13", labeldistance=1.5 headhref="dir_000071_000061.html"];
}
