digraph "Graphical Class Hierarchy"
{
  edge [fontname="Helvetica",fontsize="10",labelfontname="Helvetica",labelfontsize="10"];
  node [fontname="Helvetica",fontsize="10",shape=record];
  rankdir="LR";
  Node1 [label="alexaClientSDK::afml\l::test::FocusChangeManager",height=0.2,width=0.4,color="black", fillcolor="white", style="filled",URL="$classalexa_client_s_d_k_1_1afml_1_1test_1_1_focus_change_manager.html",tooltip="Manages testing focus changes. "];
  Node1 -> Node2 [dir="back",color="midnightblue",fontsize="10",style="solid",fontname="Helvetica"];
  Node2 [label="alexaClientSDK::afml\l::test::ChannelTest",height=0.2,width=0.4,color="black", fillcolor="white", style="filled",URL="$classalexa_client_s_d_k_1_1afml_1_1test_1_1_channel_test.html",tooltip="Test fixture for testing Channel. "];
  Node1 -> Node3 [dir="back",color="midnightblue",fontsize="10",style="solid",fontname="Helvetica"];
  Node3 [label="alexaClientSDK::afml\l::test::FocusManagerTest",height=0.2,width=0.4,color="black", fillcolor="white", style="filled",URL="$classalexa_client_s_d_k_1_1afml_1_1test_1_1_focus_manager_test.html",tooltip="Test fixture for testing FocusManager. "];
  Node4 [label="alexaClientSDK::avsCommon\l::test::StateChangeManager",height=0.2,width=0.4,color="black", fillcolor="white", style="filled",URL="$classalexa_client_s_d_k_1_1avs_common_1_1test_1_1_state_change_manager.html",tooltip="Manages testing state changes. "];
  Node4 -> Node5 [dir="back",color="midnightblue",fontsize="10",style="solid",fontname="Helvetica"];
  Node5 [label="alexaClientSDK::avsCommon\l::test::DialogUXAggregatorTest",height=0.2,width=0.4,color="black", fillcolor="white", style="filled",URL="$classalexa_client_s_d_k_1_1avs_common_1_1test_1_1_dialog_u_x_aggregator_test.html",tooltip="Test fixture for testing DialogUXStateAggregator. "];
  Node6 [label="Test",height=0.2,width=0.4,color="grey75", fillcolor="white", style="filled"];
  Node6 -> Node7 [dir="back",color="midnightblue",fontsize="10",style="solid",fontname="Helvetica"];
  Node7 [label="alexaClientSDK::acl\l::test::AVSConnectionManagerTest",height=0.2,width=0.4,color="black", fillcolor="white", style="filled",URL="$classalexa_client_s_d_k_1_1acl_1_1test_1_1_a_v_s_connection_manager_test.html",tooltip="Test harness for AVSConnectionManager class. "];
  Node6 -> Node8 [dir="back",color="midnightblue",fontsize="10",style="solid",fontname="Helvetica"];
  Node8 [label="alexaClientSDK::acl\l::test::MessageRouterTest",height=0.2,width=0.4,color="black", fillcolor="white", style="filled",URL="$classalexa_client_s_d_k_1_1acl_1_1test_1_1_message_router_test.html"];
  Node6 -> Node9 [dir="back",color="midnightblue",fontsize="10",style="solid",fontname="Helvetica"];
  Node9 [label="alexaClientSDK::adsl\l::test::DirectiveProcessorTest",height=0.2,width=0.4,color="black", fillcolor="white", style="filled",URL="$classalexa_client_s_d_k_1_1adsl_1_1test_1_1_directive_processor_test.html"];
  Node6 -> Node10 [dir="back",color="midnightblue",fontsize="10",style="solid",fontname="Helvetica"];
  Node10 [label="alexaClientSDK::adsl\l::test::DirectiveRouterTest",height=0.2,width=0.4,color="black", fillcolor="white", style="filled",URL="$classalexa_client_s_d_k_1_1adsl_1_1test_1_1_directive_router_test.html"];
  Node6 -> Node11 [dir="back",color="midnightblue",fontsize="10",style="solid",fontname="Helvetica"];
  Node11 [label="alexaClientSDK::adsl\l::test::DirectiveSequencerTest",height=0.2,width=0.4,color="black", fillcolor="white", style="filled",URL="$classalexa_client_s_d_k_1_1adsl_1_1test_1_1_directive_sequencer_test.html",tooltip="DirectiveSequencerTest. "];
  Node6 -> Node12 [dir="back",color="midnightblue",fontsize="10",style="solid",fontname="Helvetica"];
  Node12 [label="alexaClientSDK::adsl\l::test::MessageIntepreterTest",height=0.2,width=0.4,color="black", fillcolor="white", style="filled",URL="$classalexa_client_s_d_k_1_1adsl_1_1test_1_1_message_intepreter_test.html"];
  Node6 -> Node13 [dir="back",color="midnightblue",fontsize="10",style="solid",fontname="Helvetica"];
  Node13 [label="alexaClientSDK::afml\l::test::AudioActivityTrackerTest",height=0.2,width=0.4,color="black", fillcolor="white", style="filled",URL="$classalexa_client_s_d_k_1_1afml_1_1test_1_1_audio_activity_tracker_test.html"];
  Node6 -> Node2 [dir="back",color="midnightblue",fontsize="10",style="solid",fontname="Helvetica"];
  Node6 -> Node3 [dir="back",color="midnightblue",fontsize="10",style="solid",fontname="Helvetica"];
  Node6 -> Node14 [dir="back",color="midnightblue",fontsize="10",style="solid",fontname="Helvetica"];
  Node14 [label="alexaClientSDK::afml\l::test::VisualActivityTrackerTest",height=0.2,width=0.4,color="black", fillcolor="white", style="filled",URL="$classalexa_client_s_d_k_1_1afml_1_1test_1_1_visual_activity_tracker_test.html",tooltip="Test harness for VisualActivityTrackerTest class. "];
  Node6 -> Node15 [dir="back",color="midnightblue",fontsize="10",style="solid",fontname="Helvetica"];
  Node15 [label="alexaClientSDK::avsCommon\l::avs::test::AttachmentManagerTest",height=0.2,width=0.4,color="black", fillcolor="white", style="filled",URL="$classalexa_client_s_d_k_1_1avs_common_1_1avs_1_1test_1_1_attachment_manager_test.html"];
  Node6 -> Node16 [dir="back",color="midnightblue",fontsize="10",style="solid",fontname="Helvetica"];
  Node16 [label="alexaClientSDK::avsCommon\l::avs::test::AttachmentReaderTest",height=0.2,width=0.4,color="black", fillcolor="white", style="filled",URL="$classalexa_client_s_d_k_1_1avs_common_1_1avs_1_1test_1_1_attachment_reader_test.html"];
  Node6 -> Node17 [dir="back",color="midnightblue",fontsize="10",style="solid",fontname="Helvetica"];
  Node17 [label="alexaClientSDK::avsCommon\l::avs::test::AttachmentTest",height=0.2,width=0.4,color="black", fillcolor="white", style="filled",URL="$classalexa_client_s_d_k_1_1avs_common_1_1avs_1_1test_1_1_attachment_test.html"];
  Node6 -> Node18 [dir="back",color="midnightblue",fontsize="10",style="solid",fontname="Helvetica"];
  Node18 [label="alexaClientSDK::avsCommon\l::avs::test::AttachmentUtilsTest",height=0.2,width=0.4,color="black", fillcolor="white", style="filled",URL="$classalexa_client_s_d_k_1_1avs_common_1_1avs_1_1test_1_1_attachment_utils_test.html"];
  Node6 -> Node19 [dir="back",color="midnightblue",fontsize="10",style="solid",fontname="Helvetica"];
  Node19 [label="alexaClientSDK::avsCommon\l::avs::test::AttachmentWriterTest",height=0.2,width=0.4,color="black", fillcolor="white", style="filled",URL="$classalexa_client_s_d_k_1_1avs_common_1_1avs_1_1test_1_1_attachment_writer_test.html"];
  Node6 -> Node20 [dir="back",color="midnightblue",fontsize="10",style="solid",fontname="Helvetica"];
  Node20 [label="alexaClientSDK::avsCommon\l::avs::test::CapabilityConfigurationTest",height=0.2,width=0.4,color="black", fillcolor="white", style="filled",URL="$classalexa_client_s_d_k_1_1avs_common_1_1avs_1_1test_1_1_capability_configuration_test.html"];
  Node6 -> Node21 [dir="back",color="midnightblue",fontsize="10",style="solid",fontname="Helvetica"];
  Node21 [label="alexaClientSDK::avsCommon\l::avs::test::HandlerAndPolicyTest",height=0.2,width=0.4,color="black", fillcolor="white", style="filled",URL="$classalexa_client_s_d_k_1_1avs_common_1_1avs_1_1test_1_1_handler_and_policy_test.html"];
  Node6 -> Node22 [dir="back",color="midnightblue",fontsize="10",style="solid",fontname="Helvetica"];
  Node22 [label="alexaClientSDK::avsCommon\l::avs::test::NamespaceAndNameTest",height=0.2,width=0.4,color="black", fillcolor="white", style="filled",URL="$classalexa_client_s_d_k_1_1avs_common_1_1avs_1_1test_1_1_namespace_and_name_test.html",tooltip="NamespaceAndNameTest. "];
  Node6 -> Node23 [dir="back",color="midnightblue",fontsize="10",style="solid",fontname="Helvetica"];
  Node23 [label="alexaClientSDK::avsCommon\l::test::BlockingPolicyTest",height=0.2,width=0.4,color="black", fillcolor="white", style="filled",URL="$classalexa_client_s_d_k_1_1avs_common_1_1test_1_1_blocking_policy_test.html"];
  Node6 -> Node24 [dir="back",color="midnightblue",fontsize="10",style="solid",fontname="Helvetica"];
  Node24 [label="alexaClientSDK::avsCommon\l::test::CapabilityAgentTest",height=0.2,width=0.4,color="black", fillcolor="white", style="filled",URL="$classalexa_client_s_d_k_1_1avs_common_1_1test_1_1_capability_agent_test.html"];
  Node6 -> Node5 [dir="back",color="midnightblue",fontsize="10",style="solid",fontname="Helvetica"];
  Node6 -> Node25 [dir="back",color="midnightblue",fontsize="10",style="solid",fontname="Helvetica"];
  Node25 [label="alexaClientSDK::avsCommon\l::test::ExceptionEncounteredSenderTest",height=0.2,width=0.4,color="black", fillcolor="white", style="filled",URL="$classalexa_client_s_d_k_1_1avs_common_1_1test_1_1_exception_encountered_sender_test.html",tooltip="Test harness for ExceptionEncounteredSender class. "];
  Node6 -> Node26 [dir="back",color="midnightblue",fontsize="10",style="solid",fontname="Helvetica"];
  Node26 [label="alexaClientSDK::avsCommon\l::test::MIMEParserTest",height=0.2,width=0.4,color="black", fillcolor="white", style="filled",URL="$classalexa_client_s_d_k_1_1avs_common_1_1test_1_1_m_i_m_e_parser_test.html"];
  Node6 -> Node27 [dir="back",color="midnightblue",fontsize="10",style="solid",fontname="Helvetica"];
  Node27 [label="alexaClientSDK::avsCommon\l::test::UUIDGenerationTest",height=0.2,width=0.4,color="black", fillcolor="white", style="filled",URL="$classalexa_client_s_d_k_1_1avs_common_1_1test_1_1_u_u_i_d_generation_test.html"];
  Node6 -> Node28 [dir="back",color="midnightblue",fontsize="10",style="solid",fontname="Helvetica"];
  Node28 [label="alexaClientSDK::avsCommon\l::utils::configuration\l::test::ConfigurationNodeTest",height=0.2,width=0.4,color="black", fillcolor="white", style="filled",URL="$classalexa_client_s_d_k_1_1avs_common_1_1utils_1_1configuration_1_1test_1_1_configuration_node_test.html"];
  Node6 -> Node29 [dir="back",color="midnightblue",fontsize="10",style="solid",fontname="Helvetica"];
  Node29 [label="alexaClientSDK::avsCommon\l::utils::json::test::JSONUtilTest",height=0.2,width=0.4,color="black", fillcolor="white", style="filled",URL="$classalexa_client_s_d_k_1_1avs_common_1_1utils_1_1json_1_1test_1_1_j_s_o_n_util_test.html",tooltip="Define test fixture for testing AVSMessage. "];
  Node6 -> Node30 [dir="back",color="midnightblue",fontsize="10",style="solid",fontname="Helvetica"];
  Node30 [label="alexaClientSDK::avsCommon\l::utils::logger::test::\lHTTPContentTest",height=0.2,width=0.4,color="black", fillcolor="white", style="filled",URL="$classalexa_client_s_d_k_1_1avs_common_1_1utils_1_1logger_1_1test_1_1_h_t_t_p_content_test.html"];
  Node6 -> Node31 [dir="back",color="midnightblue",fontsize="10",style="solid",fontname="Helvetica"];
  Node31 [label="alexaClientSDK::avsCommon\l::utils::logger::test::\lLogEntryStreamTest",height=0.2,width=0.4,color="black", fillcolor="white", style="filled",URL="$classalexa_client_s_d_k_1_1avs_common_1_1utils_1_1logger_1_1test_1_1_log_entry_stream_test.html"];
  Node6 -> Node32 [dir="back",color="midnightblue",fontsize="10",style="solid",fontname="Helvetica"];
  Node32 [label="alexaClientSDK::avsCommon\l::utils::logger::test::\lLoggerTest",height=0.2,width=0.4,color="black", fillcolor="white", style="filled",URL="$classalexa_client_s_d_k_1_1avs_common_1_1utils_1_1logger_1_1test_1_1_logger_test.html"];
  Node6 -> Node33 [dir="back",color="midnightblue",fontsize="10",style="solid",fontname="Helvetica"];
  Node33 [label="alexaClientSDK::avsCommon\l::utils::sds::test::SharedData\lStreamTest",height=0.2,width=0.4,color="black", fillcolor="white", style="filled",URL="$classalexa_client_s_d_k_1_1avs_common_1_1utils_1_1sds_1_1test_1_1_shared_data_stream_test.html",tooltip="The test harness for the tests below. "];
  Node6 -> Node34 [dir="back",color="midnightblue",fontsize="10",style="solid",fontname="Helvetica"];
  Node34 [label="alexaClientSDK::avsCommon\l::utils::test::StreambufTest",height=0.2,width=0.4,color="black", fillcolor="white", style="filled",URL="$classalexa_client_s_d_k_1_1avs_common_1_1utils_1_1test_1_1_streambuf_test.html"];
  Node6 -> Node35 [dir="back",color="midnightblue",fontsize="10",style="solid",fontname="Helvetica"];
  Node35 [label="alexaClientSDK::avsCommon\l::utils::test::StreamFunctionsTest",height=0.2,width=0.4,color="black", fillcolor="white", style="filled",URL="$classalexa_client_s_d_k_1_1avs_common_1_1utils_1_1test_1_1_stream_functions_test.html"];
  Node6 -> Node36 [dir="back",color="midnightblue",fontsize="10",style="solid",fontname="Helvetica"];
  Node36 [label="alexaClientSDK::avsCommon\l::utils::threading::test\l::ExecutorTest",height=0.2,width=0.4,color="black", fillcolor="white", style="filled",URL="$classalexa_client_s_d_k_1_1avs_common_1_1utils_1_1threading_1_1test_1_1_executor_test.html"];
  Node6 -> Node37 [dir="back",color="midnightblue",fontsize="10",style="solid",fontname="Helvetica"];
  Node37 [label="alexaClientSDK::avsCommon\l::utils::timing::test::\lStopwatchTest",height=0.2,width=0.4,color="black", fillcolor="white", style="filled",URL="$classalexa_client_s_d_k_1_1avs_common_1_1utils_1_1timing_1_1test_1_1_stopwatch_test.html",tooltip="Test harness for Stopwatch class. "];
  Node6 -> Node38 [dir="back",color="midnightblue",fontsize="10",style="solid",fontname="Helvetica"];
  Node38 [label="alexaClientSDK::avsCommon\l::utils::timing::test::\lTimerTest",height=0.2,width=0.4,color="black", fillcolor="white", style="filled",URL="$classalexa_client_s_d_k_1_1avs_common_1_1utils_1_1timing_1_1test_1_1_timer_test.html",tooltip="Test harness for Timer class. "];
  Node6 -> Node39 [dir="back",color="midnightblue",fontsize="10",style="solid",fontname="Helvetica"];
  Node39 [label="alexaClientSDK::bluetooth\lImplementations::blueZ\l::test::BlueZAVRCPTargetTest",height=0.2,width=0.4,color="black", fillcolor="white", style="filled",URL="$classalexa_client_s_d_k_1_1bluetooth_implementations_1_1blue_z_1_1test_1_1_blue_z_a_v_r_c_p_target_test.html"];
  Node6 -> Node40 [dir="back",color="midnightblue",fontsize="10",style="solid",fontname="Helvetica"];
  Node40 [label="alexaClientSDK::bluetooth\lImplementations::blueZ\l::test::MPRISPlayerTest",height=0.2,width=0.4,color="black", fillcolor="white", style="filled",URL="$classalexa_client_s_d_k_1_1bluetooth_implementations_1_1blue_z_1_1test_1_1_m_p_r_i_s_player_test.html"];
  Node40 -> Node41 [dir="back",color="midnightblue",fontsize="10",style="solid",fontname="Helvetica"];
  Node41 [label="alexaClientSDK::bluetooth\lImplementations::blueZ\l::test::MPRISPlayerSupportedAVRCPTest",height=0.2,width=0.4,color="black", fillcolor="white", style="filled",URL="$classalexa_client_s_d_k_1_1bluetooth_implementations_1_1blue_z_1_1test_1_1_m_p_r_i_s_player_supported_a_v_r_c_p_test.html",tooltip="Parameterized test fixture for supported org.mpris.MediaPlayer2.Player DBus AVRCP Methods..."];
  Node40 -> Node42 [dir="back",color="midnightblue",fontsize="10",style="solid",fontname="Helvetica"];
  Node42 [label="alexaClientSDK::bluetooth\lImplementations::blueZ\l::test::MPRISPlayerUnsupportedTest",height=0.2,width=0.4,color="black", fillcolor="white", style="filled",URL="$classalexa_client_s_d_k_1_1bluetooth_implementations_1_1blue_z_1_1test_1_1_m_p_r_i_s_player_unsupported_test.html",tooltip="Parameterized test fixture for unsupported DBus AVRCP Methods. "];
  Node6 -> Node43 [dir="back",color="midnightblue",fontsize="10",style="solid",fontname="Helvetica"];
  Node43 [label="alexaClientSDK::capabilities\lDelegate::test::CapabilitiesDelegateTest",height=0.2,width=0.4,color="black", fillcolor="white", style="filled",URL="$classalexa_client_s_d_k_1_1capabilities_delegate_1_1test_1_1_capabilities_delegate_test.html"];
  Node6 -> Node44 [dir="back",color="midnightblue",fontsize="10",style="solid",fontname="Helvetica"];
  Node44 [label="alexaClientSDK::capability\lAgents::aip::test::AudioInputProcessorTest",height=0.2,width=0.4,color="black", fillcolor="white", style="filled",URL="$classalexa_client_s_d_k_1_1capability_agents_1_1aip_1_1test_1_1_audio_input_processor_test.html",tooltip="Test harness for AudioInputProcessor class. "];
  Node6 -> Node45 [dir="back",color="midnightblue",fontsize="10",style="solid",fontname="Helvetica"];
  Node45 [label="alexaClientSDK::capability\lAgents::aip::test::ESPDataTest",height=0.2,width=0.4,color="black", fillcolor="white", style="filled",URL="$classalexa_client_s_d_k_1_1capability_agents_1_1aip_1_1test_1_1_e_s_p_data_test.html",tooltip="Test harness for ESPData class. "];
  Node6 -> Node46 [dir="back",color="midnightblue",fontsize="10",style="solid",fontname="Helvetica"];
  Node46 [label="alexaClientSDK::capability\lAgents::alerts::renderer\l::test::RendererTest",height=0.2,width=0.4,color="black", fillcolor="white", style="filled",URL="$classalexa_client_s_d_k_1_1capability_agents_1_1alerts_1_1renderer_1_1test_1_1_renderer_test.html"];
  Node6 -> Node47 [dir="back",color="midnightblue",fontsize="10",style="solid",fontname="Helvetica"];
  Node47 [label="alexaClientSDK::capability\lAgents::alerts::test::AlarmAlertTest",height=0.2,width=0.4,color="black", fillcolor="white", style="filled",URL="$classalexa_client_s_d_k_1_1capability_agents_1_1alerts_1_1test_1_1_alarm_alert_test.html"];
  Node6 -> Node48 [dir="back",color="midnightblue",fontsize="10",style="solid",fontname="Helvetica"];
  Node48 [label="alexaClientSDK::capability\lAgents::alerts::test::AlertsCapability\lAgentTest",height=0.2,width=0.4,color="black", fillcolor="white", style="filled",URL="$classalexa_client_s_d_k_1_1capability_agents_1_1alerts_1_1test_1_1_alerts_capability_agent_test.html"];
  Node6 -> Node49 [dir="back",color="midnightblue",fontsize="10",style="solid",fontname="Helvetica"];
  Node49 [label="alexaClientSDK::capability\lAgents::alerts::test::AlertSchedulerTest",height=0.2,width=0.4,color="black", fillcolor="white", style="filled",URL="$classalexa_client_s_d_k_1_1capability_agents_1_1alerts_1_1test_1_1_alert_scheduler_test.html"];
  Node6 -> Node50 [dir="back",color="midnightblue",fontsize="10",style="solid",fontname="Helvetica"];
  Node50 [label="alexaClientSDK::capability\lAgents::alerts::test::AlertTest",height=0.2,width=0.4,color="black", fillcolor="white", style="filled",URL="$classalexa_client_s_d_k_1_1capability_agents_1_1alerts_1_1test_1_1_alert_test.html"];
  Node6 -> Node51 [dir="back",color="midnightblue",fontsize="10",style="solid",fontname="Helvetica"];
  Node51 [label="alexaClientSDK::capability\lAgents::alerts::test::Reminder\lAlertTest",height=0.2,width=0.4,color="black", fillcolor="white", style="filled",URL="$classalexa_client_s_d_k_1_1capability_agents_1_1alerts_1_1test_1_1_reminder_alert_test.html"];
  Node6 -> Node52 [dir="back",color="midnightblue",fontsize="10",style="solid",fontname="Helvetica"];
  Node52 [label="alexaClientSDK::capability\lAgents::alerts::test::TimerAlertTest",height=0.2,width=0.4,color="black", fillcolor="white", style="filled",URL="$classalexa_client_s_d_k_1_1capability_agents_1_1alerts_1_1test_1_1_timer_alert_test.html"];
  Node6 -> Node53 [dir="back",color="midnightblue",fontsize="10",style="solid",fontname="Helvetica"];
  Node53 [label="alexaClientSDK::capability\lAgents::audioPlayer::test\l::AudioPlayerTest",height=0.2,width=0.4,color="black", fillcolor="white", style="filled",URL="$classalexa_client_s_d_k_1_1capability_agents_1_1audio_player_1_1test_1_1_audio_player_test.html"];
  Node6 -> Node54 [dir="back",color="midnightblue",fontsize="10",style="solid",fontname="Helvetica"];
  Node54 [label="alexaClientSDK::capability\lAgents::audioPlayer::test\l::ProgressTimerTest",height=0.2,width=0.4,color="black", fillcolor="white", style="filled",URL="$classalexa_client_s_d_k_1_1capability_agents_1_1audio_player_1_1test_1_1_progress_timer_test.html"];
  Node6 -> Node55 [dir="back",color="midnightblue",fontsize="10",style="solid",fontname="Helvetica"];
  Node55 [label="alexaClientSDK::capability\lAgents::bluetooth::test\l::BluetoothAVRCPTransformerTest",height=0.2,width=0.4,color="black", fillcolor="white", style="filled",URL="$classalexa_client_s_d_k_1_1capability_agents_1_1bluetooth_1_1test_1_1_bluetooth_a_v_r_c_p_transformer_test.html"];
  Node6 -> Node56 [dir="back",color="midnightblue",fontsize="10",style="solid",fontname="Helvetica"];
  Node56 [label="alexaClientSDK::capability\lAgents::bluetooth::test\l::SQLiteBluetoothStorageTest",height=0.2,width=0.4,color="black", fillcolor="white", style="filled",URL="$classalexa_client_s_d_k_1_1capability_agents_1_1bluetooth_1_1test_1_1_s_q_lite_bluetooth_storage_test.html"];
  Node6 -> Node57 [dir="back",color="midnightblue",fontsize="10",style="solid",fontname="Helvetica"];
  Node57 [label="alexaClientSDK::capability\lAgents::doNotDisturb::test\l::DoNotDisturbCapabilityAgentTest",height=0.2,width=0.4,color="black", fillcolor="white", style="filled",URL="$classalexa_client_s_d_k_1_1capability_agents_1_1do_not_disturb_1_1test_1_1_do_not_disturb_capability_agent_test.html",tooltip="Test harness for DoNotDisturbCapabilityAgent class. "];
  Node6 -> Node58 [dir="back",color="midnightblue",fontsize="10",style="solid",fontname="Helvetica"];
  Node58 [label="alexaClientSDK::capability\lAgents::externalMediaPlayer\l::test::ExternalMediaPlayerTest",height=0.2,width=0.4,color="black", fillcolor="white", style="filled",URL="$classalexa_client_s_d_k_1_1capability_agents_1_1external_media_player_1_1test_1_1_external_media_player_test.html"];
  Node6 -> Node59 [dir="back",color="midnightblue",fontsize="10",style="solid",fontname="Helvetica"];
  Node59 [label="alexaClientSDK::capability\lAgents::mrm::test::MRMCapability\lAgentTest",height=0.2,width=0.4,color="black", fillcolor="white", style="filled",URL="$classalexa_client_s_d_k_1_1capability_agents_1_1mrm_1_1test_1_1_m_r_m_capability_agent_test.html",tooltip="Test harness for MRMCapabilityAgent class. "];
  Node6 -> Node60 [dir="back",color="midnightblue",fontsize="10",style="solid",fontname="Helvetica"];
  Node60 [label="alexaClientSDK::capability\lAgents::notifications::\ltest::NotificationRendererTest",height=0.2,width=0.4,color="black", fillcolor="white", style="filled",URL="$classalexa_client_s_d_k_1_1capability_agents_1_1notifications_1_1test_1_1_notification_renderer_test.html"];
  Node6 -> Node61 [dir="back",color="midnightblue",fontsize="10",style="solid",fontname="Helvetica"];
  Node61 [label="alexaClientSDK::capability\lAgents::notifications::\ltest::NotificationsCapabilityAgentTest",height=0.2,width=0.4,color="black", fillcolor="white", style="filled",URL="$classalexa_client_s_d_k_1_1capability_agents_1_1notifications_1_1test_1_1_notifications_capability_agent_test.html"];
  Node6 -> Node62 [dir="back",color="midnightblue",fontsize="10",style="solid",fontname="Helvetica"];
  Node62 [label="alexaClientSDK::capability\lAgents::notifications::\ltest::NotificationsStorageTest",height=0.2,width=0.4,color="black", fillcolor="white", style="filled",URL="$classalexa_client_s_d_k_1_1capability_agents_1_1notifications_1_1test_1_1_notifications_storage_test.html"];
  Node6 -> Node63 [dir="back",color="midnightblue",fontsize="10",style="solid",fontname="Helvetica"];
  Node63 [label="alexaClientSDK::capability\lAgents::playbackController\l::test::PlaybackControllerTest",height=0.2,width=0.4,color="black", fillcolor="white", style="filled",URL="$classalexa_client_s_d_k_1_1capability_agents_1_1playback_controller_1_1test_1_1_playback_controller_test.html",tooltip="Test harness for StateSynchronizer class. "];
  Node6 -> Node64 [dir="back",color="midnightblue",fontsize="10",style="solid",fontname="Helvetica"];
  Node64 [label="alexaClientSDK::capability\lAgents::playbackController\l::test::PlaybackRouterTest",height=0.2,width=0.4,color="black", fillcolor="white", style="filled",URL="$classalexa_client_s_d_k_1_1capability_agents_1_1playback_controller_1_1test_1_1_playback_router_test.html"];
  Node6 -> Node65 [dir="back",color="midnightblue",fontsize="10",style="solid",fontname="Helvetica"];
  Node65 [label="alexaClientSDK::capability\lAgents::settings::test\l::SettingsTest",height=0.2,width=0.4,color="black", fillcolor="white", style="filled",URL="$classalexa_client_s_d_k_1_1capability_agents_1_1settings_1_1test_1_1_settings_test.html",tooltip="Test harness for Settings class. "];
  Node6 -> Node66 [dir="back",color="midnightblue",fontsize="10",style="solid",fontname="Helvetica"];
  Node66 [label="alexaClientSDK::capability\lAgents::speechSynthesizer\l::test::SpeechSynthesizerTest",height=0.2,width=0.4,color="black", fillcolor="white", style="filled",URL="$classalexa_client_s_d_k_1_1capability_agents_1_1speech_synthesizer_1_1test_1_1_speech_synthesizer_test.html"];
  Node6 -> Node67 [dir="back",color="midnightblue",fontsize="10",style="solid",fontname="Helvetica"];
  Node67 [label="alexaClientSDK::capability\lAgents::system::test::Endpoint\lHandlerTest",height=0.2,width=0.4,color="black", fillcolor="white", style="filled",URL="$classalexa_client_s_d_k_1_1capability_agents_1_1system_1_1test_1_1_endpoint_handler_test.html",tooltip="Test harness for EndpointHandler class. "];
  Node6 -> Node68 [dir="back",color="midnightblue",fontsize="10",style="solid",fontname="Helvetica"];
  Node68 [label="alexaClientSDK::capability\lAgents::system::test::RevokeAuthorization\lHandlerTest",height=0.2,width=0.4,color="black", fillcolor="white", style="filled",URL="$classalexa_client_s_d_k_1_1capability_agents_1_1system_1_1test_1_1_revoke_authorization_handler_test.html",tooltip="Test harness for RevokeAuthorizationHandler class. "];
  Node6 -> Node69 [dir="back",color="midnightblue",fontsize="10",style="solid",fontname="Helvetica"];
  Node69 [label="alexaClientSDK::capability\lAgents::system::test::Software\lInfoSenderTest",height=0.2,width=0.4,color="black", fillcolor="white", style="filled",URL="$classalexa_client_s_d_k_1_1capability_agents_1_1system_1_1test_1_1_software_info_sender_test.html",tooltip="Test harness for SoftwareInfoSender class. "];
  Node6 -> Node70 [dir="back",color="midnightblue",fontsize="10",style="solid",fontname="Helvetica"];
  Node70 [label="alexaClientSDK::capability\lAgents::system::test::UserInactivity\lMonitorTest",height=0.2,width=0.4,color="black", fillcolor="white", style="filled",URL="$classalexa_client_s_d_k_1_1capability_agents_1_1system_1_1test_1_1_user_inactivity_monitor_test.html",tooltip="Test harness for UserInactivityMonitor class. "];
  Node6 -> Node71 [dir="back",color="midnightblue",fontsize="10",style="solid",fontname="Helvetica"];
  Node71 [label="alexaClientSDK::capability\lAgents::templateRuntime\l::test::TemplateRuntimeTest",height=0.2,width=0.4,color="black", fillcolor="white", style="filled",URL="$classalexa_client_s_d_k_1_1capability_agents_1_1template_runtime_1_1test_1_1_template_runtime_test.html",tooltip="Test harness for TemplateRuntime class. "];
  Node6 -> Node72 [dir="back",color="midnightblue",fontsize="10",style="solid",fontname="Helvetica"];
  Node72 [label="alexaClientSDK::certified\lSender::test::CertifiedSenderTest",height=0.2,width=0.4,color="black", fillcolor="white", style="filled",URL="$classalexa_client_s_d_k_1_1certified_sender_1_1test_1_1_certified_sender_test.html"];
  Node6 -> Node73 [dir="back",color="midnightblue",fontsize="10",style="solid",fontname="Helvetica"];
  Node73 [label="alexaClientSDK::certified\lSender::test::MessageStorageTest",height=0.2,width=0.4,color="black", fillcolor="white", style="filled",URL="$classalexa_client_s_d_k_1_1certified_sender_1_1test_1_1_message_storage_test.html"];
  Node6 -> Node74 [dir="back",color="midnightblue",fontsize="10",style="solid",fontname="Helvetica"];
  Node74 [label="alexaClientSDK::contextManager\l::test::ContextManagerTest",height=0.2,width=0.4,color="black", fillcolor="white", style="filled",URL="$classalexa_client_s_d_k_1_1context_manager_1_1test_1_1_context_manager_test.html",tooltip="Context Manager Test. "];
  Node6 -> Node75 [dir="back",color="midnightblue",fontsize="10",style="solid",fontname="Helvetica"];
  Node75 [label="alexaClientSDK::equalizer\l::test::EqualizerControllerTest",height=0.2,width=0.4,color="black", fillcolor="white", style="filled",URL="$classalexa_client_s_d_k_1_1equalizer_1_1test_1_1_equalizer_controller_test.html"];
  Node6 -> Node76 [dir="back",color="midnightblue",fontsize="10",style="solid",fontname="Helvetica"];
  Node76 [label="alexaClientSDK::equalizer\l::test::EqualizerLinearBandMapperTest",height=0.2,width=0.4,color="black", fillcolor="white", style="filled",URL="$classalexa_client_s_d_k_1_1equalizer_1_1test_1_1_equalizer_linear_band_mapper_test.html"];
  Node6 -> Node77 [dir="back",color="midnightblue",fontsize="10",style="solid",fontname="Helvetica"];
  Node77 [label="alexaClientSDK::equalizer\l::test::InMemoryEqualizerConfigurationTest",height=0.2,width=0.4,color="black", fillcolor="white", style="filled",URL="$classalexa_client_s_d_k_1_1equalizer_1_1test_1_1_in_memory_equalizer_configuration_test.html"];
  Node6 -> Node78 [dir="back",color="midnightblue",fontsize="10",style="solid",fontname="Helvetica"];
  Node78 [label="alexaClientSDK::equalizer\l::test::SDKConfigEqualizerConfigurationTest",height=0.2,width=0.4,color="black", fillcolor="white", style="filled",URL="$classalexa_client_s_d_k_1_1equalizer_1_1test_1_1_s_d_k_config_equalizer_configuration_test.html"];
  Node6 -> Node79 [dir="back",color="midnightblue",fontsize="10",style="solid",fontname="Helvetica"];
  Node79 [label="alexaClientSDK::integration\l::test::AlertsTest",height=0.2,width=0.4,color="black", fillcolor="white", style="filled",URL="$classalexa_client_s_d_k_1_1integration_1_1test_1_1_alerts_test.html"];
  Node6 -> Node80 [dir="back",color="midnightblue",fontsize="10",style="solid",fontname="Helvetica"];
  Node80 [label="alexaClientSDK::integration\l::test::AlexaAuthorizationDelegateTest",height=0.2,width=0.4,color="black", fillcolor="white", style="filled",URL="$classalexa_client_s_d_k_1_1integration_1_1test_1_1_alexa_authorization_delegate_test.html"];
  Node6 -> Node81 [dir="back",color="midnightblue",fontsize="10",style="solid",fontname="Helvetica"];
  Node81 [label="alexaClientSDK::integration\l::test::AlexaCommunicationsLibraryTest",height=0.2,width=0.4,color="black", fillcolor="white", style="filled",URL="$classalexa_client_s_d_k_1_1integration_1_1test_1_1_alexa_communications_library_test.html"];
  Node6 -> Node82 [dir="back",color="midnightblue",fontsize="10",style="solid",fontname="Helvetica"];
  Node82 [label="alexaClientSDK::integration\l::test::AlexaDirectiveSequencer\lLibraryTest",height=0.2,width=0.4,color="black", fillcolor="white", style="filled",URL="$classalexa_client_s_d_k_1_1integration_1_1test_1_1_alexa_directive_sequencer_library_test.html"];
  Node6 -> Node83 [dir="back",color="midnightblue",fontsize="10",style="solid",fontname="Helvetica"];
  Node83 [label="alexaClientSDK::integration\l::test::AudioInputProcessorTest",height=0.2,width=0.4,color="black", fillcolor="white", style="filled",URL="$classalexa_client_s_d_k_1_1integration_1_1test_1_1_audio_input_processor_test.html"];
  Node6 -> Node84 [dir="back",color="midnightblue",fontsize="10",style="solid",fontname="Helvetica"];
  Node84 [label="alexaClientSDK::integration\l::test::AudioPlayerTest",height=0.2,width=0.4,color="black", fillcolor="white", style="filled",URL="$classalexa_client_s_d_k_1_1integration_1_1test_1_1_audio_player_test.html"];
  Node6 -> Node85 [dir="back",color="midnightblue",fontsize="10",style="solid",fontname="Helvetica"];
  Node85 [label="alexaClientSDK::integration\l::test::NetworkIntegrationTests",height=0.2,width=0.4,color="black", fillcolor="white", style="filled",URL="$classalexa_client_s_d_k_1_1integration_1_1test_1_1_network_integration_tests.html"];
  Node6 -> Node86 [dir="back",color="midnightblue",fontsize="10",style="solid",fontname="Helvetica"];
  Node86 [label="alexaClientSDK::integration\l::test::ServerDisconnectIntegrationTest",height=0.2,width=0.4,color="black", fillcolor="white", style="filled",URL="$classalexa_client_s_d_k_1_1integration_1_1test_1_1_server_disconnect_integration_test.html"];
  Node6 -> Node87 [dir="back",color="midnightblue",fontsize="10",style="solid",fontname="Helvetica"];
  Node87 [label="alexaClientSDK::integration\l::test::SpeechSynthesizerTest",height=0.2,width=0.4,color="black", fillcolor="white", style="filled",URL="$classalexa_client_s_d_k_1_1integration_1_1test_1_1_speech_synthesizer_test.html"];
  Node6 -> Node88 [dir="back",color="midnightblue",fontsize="10",style="solid",fontname="Helvetica"];
  Node88 [label="alexaClientSDK::kwd\l::test::AbstractKeyWordDetectorTest",height=0.2,width=0.4,color="black", fillcolor="white", style="filled",URL="$classalexa_client_s_d_k_1_1kwd_1_1test_1_1_abstract_key_word_detector_test.html"];
  Node6 -> Node89 [dir="back",color="midnightblue",fontsize="10",style="solid",fontname="Helvetica"];
  Node89 [label="alexaClientSDK::kwd\l::test::KittAiKeyWordTest",height=0.2,width=0.4,color="black", fillcolor="white", style="filled",URL="$classalexa_client_s_d_k_1_1kwd_1_1test_1_1_kitt_ai_key_word_test.html"];
  Node6 -> Node90 [dir="back",color="midnightblue",fontsize="10",style="solid",fontname="Helvetica"];
  Node90 [label="alexaClientSDK::kwd\l::test::SensoryKeywordTest",height=0.2,width=0.4,color="black", fillcolor="white", style="filled",URL="$classalexa_client_s_d_k_1_1kwd_1_1test_1_1_sensory_keyword_test.html"];
  Node6 -> Node91 [dir="back",color="midnightblue",fontsize="10",style="solid",fontname="Helvetica"];
  Node91 [label="alexaClientSDK::mediaPlayer\l::test::MediaPlayerTest",height=0.2,width=0.4,color="black", fillcolor="white", style="filled",URL="$classalexa_client_s_d_k_1_1media_player_1_1test_1_1_media_player_test.html"];
  Node6 -> Node92 [dir="back",color="midnightblue",fontsize="10",style="solid",fontname="Helvetica"];
  Node92 [label="alexaClientSDK::mediaPlayer\l::test::NormalizerTest",height=0.2,width=0.4,color="black", fillcolor="white", style="filled",URL="$classalexa_client_s_d_k_1_1media_player_1_1test_1_1_normalizer_test.html"];
  Node6 -> Node93 [dir="back",color="midnightblue",fontsize="10",style="solid",fontname="Helvetica"];
  Node93 [label="alexaClientSDK::playlist\lParser::test::ContentDecrypterTest",height=0.2,width=0.4,color="black", fillcolor="white", style="filled",URL="$classalexa_client_s_d_k_1_1playlist_parser_1_1test_1_1_content_decrypter_test.html",tooltip="Test class for ContentDecrypter class. "];
  Node6 -> Node94 [dir="back",color="midnightblue",fontsize="10",style="solid",fontname="Helvetica"];
  Node94 [label="alexaClientSDK::playlist\lParser::test::IterativePlaylist\lParserTest",height=0.2,width=0.4,color="black", fillcolor="white", style="filled",URL="$classalexa_client_s_d_k_1_1playlist_parser_1_1test_1_1_iterative_playlist_parser_test.html"];
  Node6 -> Node95 [dir="back",color="midnightblue",fontsize="10",style="solid",fontname="Helvetica"];
  Node95 [label="alexaClientSDK::playlist\lParser::test::PlaylistParserTest",height=0.2,width=0.4,color="black", fillcolor="white", style="filled",URL="$classalexa_client_s_d_k_1_1playlist_parser_1_1test_1_1_playlist_parser_test.html"];
  Node6 -> Node96 [dir="back",color="midnightblue",fontsize="10",style="solid",fontname="Helvetica"];
  Node96 [label="alexaClientSDK::registration\lManager::test::CustomerDataManagerTest",height=0.2,width=0.4,color="black", fillcolor="white", style="filled",URL="$classalexa_client_s_d_k_1_1registration_manager_1_1test_1_1_customer_data_manager_test.html"];
  Node6 -> Node97 [dir="back",color="midnightblue",fontsize="10",style="solid",fontname="Helvetica"];
  Node97 [label="alexaClientSDK::registration\lManager::test::RegistrationManagerTest",height=0.2,width=0.4,color="black", fillcolor="white", style="filled",URL="$classalexa_client_s_d_k_1_1registration_manager_1_1test_1_1_registration_manager_test.html"];
  Node6 -> Node98 [dir="back",color="midnightblue",fontsize="10",style="solid",fontname="Helvetica"];
  Node98 [label="alexaClientSDK::settings\l::storage::test::SQLiteDeviceSettings\lStorageTest",height=0.2,width=0.4,color="black", fillcolor="white", style="filled",URL="$classalexa_client_s_d_k_1_1settings_1_1storage_1_1test_1_1_s_q_lite_device_settings_storage_test.html"];
  Node6 -> Node99 [dir="back",color="midnightblue",fontsize="10",style="solid",fontname="Helvetica"];
  Node99 [label="alexaClientSDK::settings\l::test::SettingsManagerTest",height=0.2,width=0.4,color="black", fillcolor="white", style="filled",URL="$classalexa_client_s_d_k_1_1settings_1_1test_1_1_settings_manager_test.html",tooltip="Test class. "];
  Node6 -> Node100 [dir="back",color="midnightblue",fontsize="10",style="solid",fontname="Helvetica"];
  Node100 [label="alexaClientSDK::speechencoder\l::test::SpeechEncoderTest",height=0.2,width=0.4,color="black", fillcolor="white", style="filled",URL="$classalexa_client_s_d_k_1_1speechencoder_1_1test_1_1_speech_encoder_test.html"];
  Node6 -> Node101 [dir="back",color="midnightblue",fontsize="10",style="solid",fontname="Helvetica"];
  Node101 [label="alexaClientSDK::storage\l::sqliteStorage::test\l::SQLiteMiscStorageTest",height=0.2,width=0.4,color="black", fillcolor="white", style="filled",URL="$classalexa_client_s_d_k_1_1storage_1_1sqlite_storage_1_1test_1_1_s_q_lite_misc_storage_test.html"];
  Node102 [label="WithParamInterface",height=0.2,width=0.4,color="grey75", fillcolor="white", style="filled"];
  Node102 -> Node41 [dir="back",color="midnightblue",fontsize="10",style="solid",fontname="Helvetica"];
  Node102 -> Node42 [dir="back",color="midnightblue",fontsize="10",style="solid",fontname="Helvetica"];
}
