digraph "/workplace/avs-device-sdk/ApplicationUtilities/Resources/Audio/src/NotificationsAudioFactory.cpp"
{
  edge [fontname="Helvetica",fontsize="10",labelfontname="Helvetica",labelfontsize="10"];
  node [fontname="Helvetica",fontsize="10",shape=record];
  Node1 [label="/workplace/avs-device\l-sdk/ApplicationUtilities\l/Resources/Audio/src/Notifications\lAudioFactory.cpp",height=0.2,width=0.4,color="black", fillcolor="grey75", style="filled", fontcolor="black"];
  Node1 -> Node2 [color="midnightblue",fontsize="10",style="solid",fontname="Helvetica"];
  Node2 [label="Audio/NotificationsAudio\lFactory.h",height=0.2,width=0.4,color="black", fillcolor="white", style="filled",URL="$_notifications_audio_factory_8h.html"];
  Node2 -> Node3 [color="midnightblue",fontsize="10",style="solid",fontname="Helvetica"];
  Node3 [label="AVSCommon/SDKInterfaces\l/Audio/NotificationsAudioFactory\lInterface.h",height=0.2,width=0.4,color="black", fillcolor="white", style="filled",URL="$_notifications_audio_factory_interface_8h.html"];
  Node3 -> Node4 [color="midnightblue",fontsize="10",style="solid",fontname="Helvetica"];
  Node4 [label="istream",height=0.2,width=0.4,color="grey75", fillcolor="white", style="filled"];
  Node3 -> Node5 [color="midnightblue",fontsize="10",style="solid",fontname="Helvetica"];
  Node5 [label="functional",height=0.2,width=0.4,color="grey75", fillcolor="white", style="filled"];
  Node3 -> Node6 [color="midnightblue",fontsize="10",style="solid",fontname="Helvetica"];
  Node6 [label="memory",height=0.2,width=0.4,color="grey75", fillcolor="white", style="filled"];
  Node1 -> Node7 [color="midnightblue",fontsize="10",style="solid",fontname="Helvetica"];
  Node7 [label="AVSCommon/Utils/Stream\l/StreamFunctions.h",height=0.2,width=0.4,color="black", fillcolor="white", style="filled",URL="$_stream_functions_8h.html"];
  Node7 -> Node6 [color="midnightblue",fontsize="10",style="solid",fontname="Helvetica"];
  Node7 -> Node4 [color="midnightblue",fontsize="10",style="solid",fontname="Helvetica"];
  Node1 -> Node8 [color="midnightblue",fontsize="10",style="solid",fontname="Helvetica"];
  Node8 [label="Audio/Data/med_alerts\l_notification_01._TTH\l_.mp3.h",height=0.2,width=0.4,color="black", fillcolor="white", style="filled",URL="$med__alerts__notification__01_8___t_t_h___8mp3_8h.html"];
}
