digraph "/workplace/avs-device-sdk/BluetoothImplementations/BlueZ/include/BlueZ/BlueZAVRCPTarget.h"
{
  edge [fontname="Helvetica",fontsize="10",labelfontname="Helvetica",labelfontsize="10"];
  node [fontname="Helvetica",fontsize="10",shape=record];
  Node1 [label="/workplace/avs-device\l-sdk/BluetoothImplementations\l/BlueZ/include/BlueZ/BlueZAVRCPTarget.h",height=0.2,width=0.4,color="black", fillcolor="grey75", style="filled", fontcolor="black"];
  Node1 -> Node2 [dir="back",color="midnightblue",fontsize="10",style="solid",fontname="Helvetica"];
  Node2 [label="/workplace/avs-device\l-sdk/BluetoothImplementations\l/BlueZ/src/BlueZAVRCPTarget.cpp",height=0.2,width=0.4,color="black", fillcolor="white", style="filled",URL="$_blue_z_a_v_r_c_p_target_8cpp.html"];
  Node1 -> Node3 [dir="back",color="midnightblue",fontsize="10",style="solid",fontname="Helvetica"];
  Node3 [label="/workplace/avs-device\l-sdk/BluetoothImplementations\l/BlueZ/src/BlueZBluetoothDevice.cpp",height=0.2,width=0.4,color="black", fillcolor="white", style="filled",URL="$_blue_z_bluetooth_device_8cpp.html"];
  Node1 -> Node4 [dir="back",color="midnightblue",fontsize="10",style="solid",fontname="Helvetica"];
  Node4 [label="/workplace/avs-device\l-sdk/BluetoothImplementations\l/BlueZ/test/BlueZAVRCPTargetTest.cpp",height=0.2,width=0.4,color="black", fillcolor="white", style="filled",URL="$_blue_z_a_v_r_c_p_target_test_8cpp.html"];
}
