digraph "/workplace/avs-device-sdk/CapabilityAgents/SpeakerManager/include/SpeakerManager" {
  compound=true
  node [ fontsize="10", fontname="Helvetica"];
  edge [ labelfontsize="10", labelfontname="Helvetica"];
  subgraph clusterdir_58f46be1458388d2fc10aa8246ff1704 {
    graph [ bgcolor="#ddddee", pencolor="black", label="include" fontname="Helvetica", fontsize="10", URL="dir_58f46be1458388d2fc10aa8246ff1704.html"]
  dir_a869cc6fda2838386502524bc993d90a [shape=box, label="SpeakerManager", style="filled", fillcolor="#eeeeff", pencolor="black", URL="dir_a869cc6fda2838386502524bc993d90a.html"];
  }
  dir_13e65effb2bde530b17b3d5eefcd0266 [shape=box label="AVSCommon" fillcolor="white" style="filled" color="red" URL="dir_13e65effb2bde530b17b3d5eefcd0266.html"];
  dir_a869cc6fda2838386502524bc993d90a->dir_13e65effb2bde530b17b3d5eefcd0266 [headlabel="12", labeldistance=1.5 headhref="dir_000191_000015.html"];
}
