digraph "alexaClientSDK::capabilityAgents::system::RevokeAuthorizationHandler"
{
  edge [fontname="Helvetica",fontsize="10",labelfontname="Helvetica",labelfontsize="10"];
  node [fontname="Helvetica",fontsize="10",shape=record];
  rankdir="LR";
  Node1 [label="alexaClientSDK::capability\lAgents::system::RevokeAuthorization\lHandler",height=0.2,width=0.4,color="black", fillcolor="grey75", style="filled", fontcolor="black"];
  Node2 -> Node1 [dir="back",color="midnightblue",fontsize="10",style="solid",fontname="Helvetica"];
  Node2 [label="alexaClientSDK::avsCommon\l::avs::CapabilityAgent",height=0.2,width=0.4,color="black", fillcolor="white", style="filled",URL="$classalexa_client_s_d_k_1_1avs_common_1_1avs_1_1_capability_agent.html"];
  Node3 -> Node2 [dir="back",color="midnightblue",fontsize="10",style="solid",fontname="Helvetica"];
  Node3 [label="alexaClientSDK::avsCommon\l::sdkInterfaces::DirectiveHandler\lInterface",height=0.2,width=0.4,color="black", fillcolor="white", style="filled",URL="$classalexa_client_s_d_k_1_1avs_common_1_1sdk_interfaces_1_1_directive_handler_interface.html"];
  Node4 -> Node2 [dir="back",color="midnightblue",fontsize="10",style="solid",fontname="Helvetica"];
  Node4 [label="alexaClientSDK::avsCommon\l::sdkInterfaces::ChannelObserver\lInterface",height=0.2,width=0.4,color="black", fillcolor="white", style="filled",URL="$classalexa_client_s_d_k_1_1avs_common_1_1sdk_interfaces_1_1_channel_observer_interface.html"];
  Node5 -> Node2 [dir="back",color="midnightblue",fontsize="10",style="solid",fontname="Helvetica"];
  Node5 [label="alexaClientSDK::avsCommon\l::sdkInterfaces::StateProvider\lInterface",height=0.2,width=0.4,color="black", fillcolor="white", style="filled",URL="$classalexa_client_s_d_k_1_1avs_common_1_1sdk_interfaces_1_1_state_provider_interface.html"];
  Node6 -> Node2 [dir="back",color="midnightblue",fontsize="10",style="solid",fontname="Helvetica"];
  Node6 [label="alexaClientSDK::avsCommon\l::sdkInterfaces::ContextRequester\lInterface",height=0.2,width=0.4,color="black", fillcolor="white", style="filled",URL="$classalexa_client_s_d_k_1_1avs_common_1_1sdk_interfaces_1_1_context_requester_interface.html"];
}
