digraph "/workplace/avs-device-sdk/AVSCommon/Utils/include/AVSCommon/Utils/HTTP2/HTTP2RequestSourceInterface.h"
{
  edge [fontname="Helvetica",fontsize="10",labelfontname="Helvetica",labelfontsize="10"];
  node [fontname="Helvetica",fontsize="10",shape=record];
  Node1 [label="/workplace/avs-device\l-sdk/AVSCommon/Utils\l/include/AVSCommon/Utils\l/HTTP2/HTTP2RequestSourceInterface.h",height=0.2,width=0.4,color="black", fillcolor="grey75", style="filled", fontcolor="black"];
  Node1 -> Node2 [dir="back",color="midnightblue",fontsize="10",style="solid",fontname="Helvetica"];
  Node2 [label="/workplace/avs-device\l-sdk/ACL/include/ACL\l/Transport/DownchannelHandler.h",height=0.2,width=0.4,color="black", fillcolor="white", style="filled",URL="$_downchannel_handler_8h.html"];
  Node2 -> Node3 [dir="back",color="midnightblue",fontsize="10",style="solid",fontname="Helvetica"];
  Node3 [label="/workplace/avs-device\l-sdk/ACL/src/Transport\l/DownchannelHandler.cpp",height=0.2,width=0.4,color="black", fillcolor="white", style="filled",URL="$_downchannel_handler_8cpp.html"];
  Node2 -> Node4 [dir="back",color="midnightblue",fontsize="10",style="solid",fontname="Helvetica"];
  Node4 [label="/workplace/avs-device\l-sdk/ACL/src/Transport\l/HTTP2Transport.cpp",height=0.2,width=0.4,color="black", fillcolor="white", style="filled",URL="$_h_t_t_p2_transport_8cpp.html"];
  Node1 -> Node5 [dir="back",color="midnightblue",fontsize="10",style="solid",fontname="Helvetica"];
  Node5 [label="/workplace/avs-device\l-sdk/ACL/include/ACL\l/Transport/PingHandler.h",height=0.2,width=0.4,color="black", fillcolor="white", style="filled",URL="$_ping_handler_8h.html"];
  Node5 -> Node6 [dir="back",color="midnightblue",fontsize="10",style="solid",fontname="Helvetica"];
  Node6 [label="/workplace/avs-device\l-sdk/ACL/include/ACL\l/Transport/HTTP2Transport.h",height=0.2,width=0.4,color="black", fillcolor="white", style="filled",URL="$_h_t_t_p2_transport_8h.html"];
  Node6 -> Node3 [dir="back",color="midnightblue",fontsize="10",style="solid",fontname="Helvetica"];
  Node6 -> Node7 [dir="back",color="midnightblue",fontsize="10",style="solid",fontname="Helvetica"];
  Node7 [label="/workplace/avs-device\l-sdk/ACL/src/Transport\l/ExchangeHandler.cpp",height=0.2,width=0.4,color="black", fillcolor="white", style="filled",URL="$_exchange_handler_8cpp.html"];
  Node6 -> Node4 [dir="back",color="midnightblue",fontsize="10",style="solid",fontname="Helvetica"];
  Node6 -> Node8 [dir="back",color="midnightblue",fontsize="10",style="solid",fontname="Helvetica"];
  Node8 [label="/workplace/avs-device\l-sdk/ACL/src/Transport\l/HTTP2TransportFactory.cpp",height=0.2,width=0.4,color="black", fillcolor="white", style="filled",URL="$_h_t_t_p2_transport_factory_8cpp.html"];
  Node6 -> Node9 [dir="back",color="midnightblue",fontsize="10",style="solid",fontname="Helvetica"];
  Node9 [label="/workplace/avs-device\l-sdk/ACL/src/Transport\l/MessageRequestHandler.cpp",height=0.2,width=0.4,color="black", fillcolor="white", style="filled",URL="$_message_request_handler_8cpp.html"];
  Node6 -> Node10 [dir="back",color="midnightblue",fontsize="10",style="solid",fontname="Helvetica"];
  Node10 [label="/workplace/avs-device\l-sdk/ACL/src/Transport\l/PingHandler.cpp",height=0.2,width=0.4,color="black", fillcolor="white", style="filled",URL="$_ping_handler_8cpp.html"];
  Node6 -> Node11 [dir="back",color="midnightblue",fontsize="10",style="solid",fontname="Helvetica"];
  Node11 [label="/workplace/avs-device\l-sdk/ACL/src/Transport\l/PostConnectSynchronizer.cpp",height=0.2,width=0.4,color="black", fillcolor="white", style="filled",URL="$_post_connect_synchronizer_8cpp.html"];
  Node6 -> Node12 [dir="back",color="midnightblue",fontsize="10",style="solid",fontname="Helvetica"];
  Node12 [label="/workplace/avs-device\l-sdk/ACL/test/Transport\l/HTTP2TransportTest.cpp",height=0.2,width=0.4,color="black", fillcolor="white", style="filled",URL="$_h_t_t_p2_transport_test_8cpp.html"];
  Node5 -> Node4 [dir="back",color="midnightblue",fontsize="10",style="solid",fontname="Helvetica"];
  Node5 -> Node10 [dir="back",color="midnightblue",fontsize="10",style="solid",fontname="Helvetica"];
  Node1 -> Node13 [dir="back",color="midnightblue",fontsize="10",style="solid",fontname="Helvetica"];
  Node13 [label="/workplace/avs-device\l-sdk/AVSCommon/Utils\l/include/AVSCommon/Utils\l/HTTP2/HTTP2MimeRequestEncoder.h",height=0.2,width=0.4,color="black", fillcolor="white", style="filled",URL="$_h_t_t_p2_mime_request_encoder_8h.html"];
  Node13 -> Node4 [dir="back",color="midnightblue",fontsize="10",style="solid",fontname="Helvetica"];
  Node13 -> Node9 [dir="back",color="midnightblue",fontsize="10",style="solid",fontname="Helvetica"];
  Node13 -> Node14 [dir="back",color="midnightblue",fontsize="10",style="solid",fontname="Helvetica"];
  Node14 [label="/workplace/avs-device\l-sdk/AVSCommon/Utils\l/src/HTTP2/HTTP2MimeRequestEncoder.cpp",height=0.2,width=0.4,color="black", fillcolor="white", style="filled",URL="$_h_t_t_p2_mime_request_encoder_8cpp.html"];
  Node13 -> Node15 [dir="back",color="midnightblue",fontsize="10",style="solid",fontname="Helvetica"];
  Node15 [label="/workplace/avs-device\l-sdk/AVSCommon/Utils\l/test/MIMEParserTest.cpp",height=0.2,width=0.4,color="black", fillcolor="white", style="filled",URL="$_m_i_m_e_parser_test_8cpp.html"];
  Node1 -> Node16 [dir="back",color="midnightblue",fontsize="10",style="solid",fontname="Helvetica"];
  Node16 [label="/workplace/avs-device\l-sdk/AVSCommon/Utils\l/include/AVSCommon/Utils\l/HTTP2/HTTP2RequestConfig.h",height=0.2,width=0.4,color="black", fillcolor="white", style="filled",URL="$_h_t_t_p2_request_config_8h.html"];
  Node16 -> Node17 [dir="back",color="midnightblue",fontsize="10",style="solid",fontname="Helvetica"];
  Node17 [label="/workplace/avs-device\l-sdk/ACL/include/ACL\l/Transport/ExchangeHandlerContext\lInterface.h",height=0.2,width=0.4,color="black", fillcolor="white", style="filled",URL="$_exchange_handler_context_interface_8h.html"];
  Node17 -> Node18 [dir="back",color="midnightblue",fontsize="10",style="solid",fontname="Helvetica"];
  Node18 [label="/workplace/avs-device\l-sdk/ACL/include/ACL\l/Transport/ExchangeHandler.h",height=0.2,width=0.4,color="black", fillcolor="white", style="filled",URL="$_exchange_handler_8h.html"];
  Node18 -> Node2 [dir="back",color="midnightblue",fontsize="10",style="solid",fontname="Helvetica"];
  Node18 -> Node19 [dir="back",color="midnightblue",fontsize="10",style="solid",fontname="Helvetica"];
  Node19 [label="/workplace/avs-device\l-sdk/ACL/include/ACL\l/Transport/MessageRequestHandler.h",height=0.2,width=0.4,color="black", fillcolor="white", style="filled",URL="$_message_request_handler_8h.html"];
  Node19 -> Node4 [dir="back",color="midnightblue",fontsize="10",style="solid",fontname="Helvetica"];
  Node19 -> Node9 [dir="back",color="midnightblue",fontsize="10",style="solid",fontname="Helvetica"];
  Node18 -> Node5 [dir="back",color="midnightblue",fontsize="10",style="solid",fontname="Helvetica"];
  Node18 -> Node7 [dir="back",color="midnightblue",fontsize="10",style="solid",fontname="Helvetica"];
  Node16 -> Node12 [dir="back",color="midnightblue",fontsize="10",style="solid",fontname="Helvetica"];
  Node16 -> Node20 [dir="back",color="midnightblue",fontsize="10",style="solid",fontname="Helvetica"];
  Node20 [label="/workplace/avs-device\l-sdk/ACL/test/Transport\l/MockHTTP2Request.h",height=0.2,width=0.4,color="black", fillcolor="white", style="filled",URL="$_mock_h_t_t_p2_request_8h.html"];
  Node20 -> Node21 [dir="back",color="midnightblue",fontsize="10",style="solid",fontname="Helvetica"];
  Node21 [label="/workplace/avs-device\l-sdk/ACL/test/Transport\l/Common/MockHTTP2Request.cpp",height=0.2,width=0.4,color="black", fillcolor="white", style="filled",URL="$_mock_h_t_t_p2_request_8cpp.html"];
  Node20 -> Node22 [dir="back",color="midnightblue",fontsize="10",style="solid",fontname="Helvetica"];
  Node22 [label="/workplace/avs-device\l-sdk/ACL/test/Transport\l/MockHTTP2Connection.h",height=0.2,width=0.4,color="black", fillcolor="white", style="filled",URL="$_mock_h_t_t_p2_connection_8h.html"];
  Node22 -> Node23 [dir="back",color="midnightblue",fontsize="10",style="solid",fontname="Helvetica"];
  Node23 [label="/workplace/avs-device\l-sdk/ACL/test/Transport\l/Common/MockHTTP2Connection.cpp",height=0.2,width=0.4,color="black", fillcolor="white", style="filled",URL="$_mock_h_t_t_p2_connection_8cpp.html"];
  Node22 -> Node12 [dir="back",color="midnightblue",fontsize="10",style="solid",fontname="Helvetica"];
  Node20 -> Node12 [dir="back",color="midnightblue",fontsize="10",style="solid",fontname="Helvetica"];
  Node16 -> Node24 [dir="back",color="midnightblue",fontsize="10",style="solid",fontname="Helvetica"];
  Node24 [label="/workplace/avs-device\l-sdk/AVSCommon/Utils\l/include/AVSCommon/Utils\l/HTTP2/HTTP2ConnectionInterface.h",height=0.2,width=0.4,color="black", fillcolor="white", style="filled",URL="$_h_t_t_p2_connection_interface_8h.html"];
  Node24 -> Node6 [dir="back",color="midnightblue",fontsize="10",style="solid",fontname="Helvetica"];
  Node24 -> Node22 [dir="back",color="midnightblue",fontsize="10",style="solid",fontname="Helvetica"];
  Node24 -> Node25 [dir="back",color="midnightblue",fontsize="10",style="solid",fontname="Helvetica"];
  Node25 [label="/workplace/avs-device\l-sdk/AVSCommon/Utils\l/include/AVSCommon/Utils\l/HTTP2/HTTP2ConnectionFactoryInterface.h",height=0.2,width=0.4,color="black", fillcolor="white", style="filled",URL="$_h_t_t_p2_connection_factory_interface_8h.html"];
  Node25 -> Node26 [dir="back",color="midnightblue",fontsize="10",style="solid",fontname="Helvetica"];
  Node26 [label="/workplace/avs-device\l-sdk/ACL/include/ACL\l/Transport/HTTP2TransportFactory.h",height=0.2,width=0.4,color="black", fillcolor="white", style="filled",URL="$_h_t_t_p2_transport_factory_8h.html"];
  Node26 -> Node8 [dir="back",color="midnightblue",fontsize="10",style="solid",fontname="Helvetica"];
  Node26 -> Node27 [dir="back",color="midnightblue",fontsize="10",style="solid",fontname="Helvetica"];
  Node27 [label="/workplace/avs-device\l-sdk/Integration/src\l/ACLTestContext.cpp",height=0.2,width=0.4,color="black", fillcolor="white", style="filled",URL="$_a_c_l_test_context_8cpp.html"];
  Node26 -> Node28 [dir="back",color="midnightblue",fontsize="10",style="solid",fontname="Helvetica"];
  Node28 [label="/workplace/avs-device\l-sdk/Integration/test\l/ServerDisconnectIntegration\lTest.cpp",height=0.2,width=0.4,color="black", fillcolor="white", style="filled",URL="$_server_disconnect_integration_test_8cpp.html"];
  Node26 -> Node29 [dir="back",color="midnightblue",fontsize="10",style="solid",fontname="Helvetica"];
  Node29 [label="/workplace/avs-device\l-sdk/SampleApp/src/SampleApplication.cpp",height=0.2,width=0.4,color="black", fillcolor="white", style="filled",URL="$_sample_application_8cpp.html"];
  Node25 -> Node30 [dir="back",color="midnightblue",fontsize="10",style="solid",fontname="Helvetica"];
  Node30 [label="/workplace/avs-device\l-sdk/AVSCommon/Utils\l/include/AVSCommon/Utils\l/LibcurlUtils/LibcurlHTTP2Connection\lFactory.h",height=0.2,width=0.4,color="black", fillcolor="white", style="filled",URL="$_libcurl_h_t_t_p2_connection_factory_8h.html"];
  Node30 -> Node31 [dir="back",color="midnightblue",fontsize="10",style="solid",fontname="Helvetica"];
  Node31 [label="/workplace/avs-device\l-sdk/AVSCommon/Utils\l/src/LibcurlUtils/LibcurlHTTP2\lConnectionFactory.cpp",height=0.2,width=0.4,color="black", fillcolor="white", style="filled",URL="$_libcurl_h_t_t_p2_connection_factory_8cpp.html"];
  Node30 -> Node27 [dir="back",color="midnightblue",fontsize="10",style="solid",fontname="Helvetica"];
  Node30 -> Node28 [dir="back",color="midnightblue",fontsize="10",style="solid",fontname="Helvetica"];
  Node30 -> Node29 [dir="back",color="midnightblue",fontsize="10",style="solid",fontname="Helvetica"];
  Node24 -> Node32 [dir="back",color="midnightblue",fontsize="10",style="solid",fontname="Helvetica"];
  Node32 [label="/workplace/avs-device\l-sdk/AVSCommon/Utils\l/include/AVSCommon/Utils\l/LibcurlUtils/LibcurlHTTP2Connection.h",height=0.2,width=0.4,color="black", fillcolor="white", style="filled",URL="$_libcurl_h_t_t_p2_connection_8h.html"];
  Node32 -> Node33 [dir="back",color="midnightblue",fontsize="10",style="solid",fontname="Helvetica"];
  Node33 [label="/workplace/avs-device\l-sdk/AVSCommon/Utils\l/src/LibcurlUtils/LibcurlHTTP2\lConnection.cpp",height=0.2,width=0.4,color="black", fillcolor="white", style="filled",URL="$_libcurl_h_t_t_p2_connection_8cpp.html"];
  Node32 -> Node31 [dir="back",color="midnightblue",fontsize="10",style="solid",fontname="Helvetica"];
  Node16 -> Node34 [dir="back",color="midnightblue",fontsize="10",style="solid",fontname="Helvetica"];
  Node34 [label="/workplace/avs-device\l-sdk/AVSCommon/Utils\l/include/AVSCommon/Utils\l/LibcurlUtils/LibcurlHTTP2Request.h",height=0.2,width=0.4,color="black", fillcolor="white", style="filled",URL="$_libcurl_h_t_t_p2_request_8h.html"];
  Node34 -> Node33 [dir="back",color="midnightblue",fontsize="10",style="solid",fontname="Helvetica"];
  Node34 -> Node35 [dir="back",color="midnightblue",fontsize="10",style="solid",fontname="Helvetica"];
  Node35 [label="/workplace/avs-device\l-sdk/AVSCommon/Utils\l/src/LibcurlUtils/LibcurlHTTP2\lRequest.cpp",height=0.2,width=0.4,color="black", fillcolor="white", style="filled",URL="$_libcurl_h_t_t_p2_request_8cpp.html"];
  Node1 -> Node36 [dir="back",color="midnightblue",fontsize="10",style="solid",fontname="Helvetica"];
  Node36 [label="/workplace/avs-device\l-sdk/AVSCommon/Utils\l/include/AVSCommon/Utils\l/HTTP2/HTTP2RequestInterface.h",height=0.2,width=0.4,color="black", fillcolor="white", style="filled",URL="$_h_t_t_p2_request_interface_8h.html"];
  Node36 -> Node17 [dir="back",color="midnightblue",fontsize="10",style="solid",fontname="Helvetica"];
  Node36 -> Node20 [dir="back",color="midnightblue",fontsize="10",style="solid",fontname="Helvetica"];
  Node36 -> Node24 [dir="back",color="midnightblue",fontsize="10",style="solid",fontname="Helvetica"];
  Node36 -> Node34 [dir="back",color="midnightblue",fontsize="10",style="solid",fontname="Helvetica"];
}
