digraph "/workplace/avs-device-sdk/CapabilityAgents/Notifications/include/Notifications/NotificationsCapabilityAgent.h"
{
  edge [fontname="Helvetica",fontsize="10",labelfontname="Helvetica",labelfontsize="10"];
  node [fontname="Helvetica",fontsize="10",shape=record];
  Node1 [label="/workplace/avs-device\l-sdk/CapabilityAgents\l/Notifications/include\l/Notifications/NotificationsCapability\lAgent.h",height=0.2,width=0.4,color="black", fillcolor="grey75", style="filled", fontcolor="black"];
  Node1 -> Node2 [color="midnightblue",fontsize="10",style="solid",fontname="Helvetica"];
  Node2 [label="memory",height=0.2,width=0.4,color="grey75", fillcolor="white", style="filled"];
  Node1 -> Node3 [color="midnightblue",fontsize="10",style="solid",fontname="Helvetica"];
  Node3 [label="unordered_set",height=0.2,width=0.4,color="grey75", fillcolor="white", style="filled"];
  Node1 -> Node4 [color="midnightblue",fontsize="10",style="solid",fontname="Helvetica"];
  Node4 [label="AVSCommon/AVS/Capability\lAgent.h",height=0.2,width=0.4,color="black", fillcolor="white", style="filled",URL="$_capability_agent_8h.html"];
  Node4 -> Node5 [color="midnightblue",fontsize="10",style="solid",fontname="Helvetica"];
  Node5 [label="atomic",height=0.2,width=0.4,color="grey75", fillcolor="white", style="filled"];
  Node4 -> Node6 [color="midnightblue",fontsize="10",style="solid",fontname="Helvetica"];
  Node6 [label="unordered_map",height=0.2,width=0.4,color="grey75", fillcolor="white", style="filled"];
  Node4 -> Node7 [color="midnightblue",fontsize="10",style="solid",fontname="Helvetica"];
  Node7 [label="string",height=0.2,width=0.4,color="grey75", fillcolor="white", style="filled"];
  Node4 -> Node2 [color="midnightblue",fontsize="10",style="solid",fontname="Helvetica"];
  Node4 -> Node8 [color="midnightblue",fontsize="10",style="solid",fontname="Helvetica"];
  Node8 [label="AVSCommon/AVS/NamespaceAnd\lName.h",height=0.2,width=0.4,color="black", fillcolor="white", style="filled",URL="$_namespace_and_name_8h.html"];
  Node8 -> Node7 [color="midnightblue",fontsize="10",style="solid",fontname="Helvetica"];
  Node4 -> Node9 [color="midnightblue",fontsize="10",style="solid",fontname="Helvetica"];
  Node9 [label="AVSCommon/SDKInterfaces\l/ExceptionEncounteredSenderInterface.h",height=0.2,width=0.4,color="black", fillcolor="white", style="filled",URL="$_exception_encountered_sender_interface_8h.html"];
  Node9 -> Node10 [color="midnightblue",fontsize="10",style="solid",fontname="Helvetica"];
  Node10 [label="AVSCommon/AVS/ExceptionError\lType.h",height=0.2,width=0.4,color="black", fillcolor="white", style="filled",URL="$_exception_error_type_8h.html"];
  Node10 -> Node11 [color="midnightblue",fontsize="10",style="solid",fontname="Helvetica"];
  Node11 [label="iostream",height=0.2,width=0.4,color="grey75", fillcolor="white", style="filled"];
  Node4 -> Node12 [color="midnightblue",fontsize="10",style="solid",fontname="Helvetica"];
  Node12 [label="AVSCommon/SDKInterfaces\l/ChannelObserverInterface.h",height=0.2,width=0.4,color="black", fillcolor="white", style="filled",URL="$_channel_observer_interface_8h.html"];
  Node12 -> Node13 [color="midnightblue",fontsize="10",style="solid",fontname="Helvetica"];
  Node13 [label="AVSCommon/AVS/FocusState.h",height=0.2,width=0.4,color="black", fillcolor="white", style="filled",URL="$_focus_state_8h.html"];
  Node13 -> Node7 [color="midnightblue",fontsize="10",style="solid",fontname="Helvetica"];
  Node4 -> Node14 [color="midnightblue",fontsize="10",style="solid",fontname="Helvetica"];
  Node14 [label="AVSCommon/SDKInterfaces\l/ContextRequesterInterface.h",height=0.2,width=0.4,color="black", fillcolor="white", style="filled",URL="$_context_requester_interface_8h.html"];
  Node14 -> Node7 [color="midnightblue",fontsize="10",style="solid",fontname="Helvetica"];
  Node14 -> Node15 [color="midnightblue",fontsize="10",style="solid",fontname="Helvetica"];
  Node15 [label="ostream",height=0.2,width=0.4,color="grey75", fillcolor="white", style="filled"];
  Node4 -> Node16 [color="midnightblue",fontsize="10",style="solid",fontname="Helvetica"];
  Node16 [label="AVSCommon/SDKInterfaces\l/StateProviderInterface.h",height=0.2,width=0.4,color="black", fillcolor="white", style="filled",URL="$_state_provider_interface_8h.html"];
  Node16 -> Node8 [color="midnightblue",fontsize="10",style="solid",fontname="Helvetica"];
  Node4 -> Node17 [color="midnightblue",fontsize="10",style="solid",fontname="Helvetica"];
  Node17 [label="AVSCommon/SDKInterfaces\l/DirectiveHandlerInterface.h",height=0.2,width=0.4,color="black", fillcolor="white", style="filled",URL="$_directive_handler_interface_8h.html"];
  Node17 -> Node2 [color="midnightblue",fontsize="10",style="solid",fontname="Helvetica"];
  Node17 -> Node18 [color="midnightblue",fontsize="10",style="solid",fontname="Helvetica"];
  Node18 [label="AVSCommon/AVS/AVSDirective.h",height=0.2,width=0.4,color="black", fillcolor="white", style="filled",URL="$_a_v_s_directive_8h.html"];
  Node18 -> Node11 [color="midnightblue",fontsize="10",style="solid",fontname="Helvetica"];
  Node18 -> Node2 [color="midnightblue",fontsize="10",style="solid",fontname="Helvetica"];
  Node18 -> Node7 [color="midnightblue",fontsize="10",style="solid",fontname="Helvetica"];
  Node18 -> Node19 [color="midnightblue",fontsize="10",style="solid",fontname="Helvetica"];
  Node19 [label="utility",height=0.2,width=0.4,color="grey75", fillcolor="white", style="filled"];
  Node18 -> Node20 [color="midnightblue",fontsize="10",style="solid",fontname="Helvetica"];
  Node20 [label="Attachment/AttachmentManager\lInterface.h",height=0.2,width=0.4,color="red", fillcolor="white", style="filled",URL="$_attachment_manager_interface_8h.html"];
  Node20 -> Node21 [color="midnightblue",fontsize="10",style="solid",fontname="Helvetica"];
  Node21 [label="chrono",height=0.2,width=0.4,color="grey75", fillcolor="white", style="filled"];
  Node20 -> Node7 [color="midnightblue",fontsize="10",style="solid",fontname="Helvetica"];
  Node20 -> Node2 [color="midnightblue",fontsize="10",style="solid",fontname="Helvetica"];
  Node20 -> Node22 [color="midnightblue",fontsize="10",style="solid",fontname="Helvetica"];
  Node22 [label="AVSCommon/AVS/Attachment\l/Attachment.h",height=0.2,width=0.4,color="red", fillcolor="white", style="filled",URL="$_attachment_8h.html"];
  Node22 -> Node5 [color="midnightblue",fontsize="10",style="solid",fontname="Helvetica"];
  Node22 -> Node23 [color="midnightblue",fontsize="10",style="solid",fontname="Helvetica"];
  Node23 [label="mutex",height=0.2,width=0.4,color="grey75", fillcolor="white", style="filled"];
  Node22 -> Node7 [color="midnightblue",fontsize="10",style="solid",fontname="Helvetica"];
  Node22 -> Node24 [color="midnightblue",fontsize="10",style="solid",fontname="Helvetica"];
  Node24 [label="AVSCommon/AVS/Attachment\l/AttachmentReader.h",height=0.2,width=0.4,color="red", fillcolor="white", style="filled",URL="$_attachment_reader_8h.html"];
  Node24 -> Node21 [color="midnightblue",fontsize="10",style="solid",fontname="Helvetica"];
  Node24 -> Node15 [color="midnightblue",fontsize="10",style="solid",fontname="Helvetica"];
  Node20 -> Node24 [color="midnightblue",fontsize="10",style="solid",fontname="Helvetica"];
  Node18 -> Node25 [color="midnightblue",fontsize="10",style="solid",fontname="Helvetica"];
  Node25 [label="AVSMessage.h",height=0.2,width=0.4,color="red", fillcolor="white", style="filled",URL="$_a_v_s_message_8h.html"];
  Node25 -> Node2 [color="midnightblue",fontsize="10",style="solid",fontname="Helvetica"];
  Node25 -> Node7 [color="midnightblue",fontsize="10",style="solid",fontname="Helvetica"];
  Node17 -> Node26 [color="midnightblue",fontsize="10",style="solid",fontname="Helvetica"];
  Node26 [label="AVSCommon/AVS/DirectiveHandler\lConfiguration.h",height=0.2,width=0.4,color="black", fillcolor="white", style="filled",URL="$_directive_handler_configuration_8h.html"];
  Node26 -> Node6 [color="midnightblue",fontsize="10",style="solid",fontname="Helvetica"];
  Node26 -> Node8 [color="midnightblue",fontsize="10",style="solid",fontname="Helvetica"];
  Node26 -> Node27 [color="midnightblue",fontsize="10",style="solid",fontname="Helvetica"];
  Node27 [label="BlockingPolicy.h",height=0.2,width=0.4,color="red", fillcolor="white", style="filled",URL="$_blocking_policy_8h.html"];
  Node27 -> Node11 [color="midnightblue",fontsize="10",style="solid",fontname="Helvetica"];
  Node17 -> Node28 [color="midnightblue",fontsize="10",style="solid",fontname="Helvetica"];
  Node28 [label="AVSCommon/SDKInterfaces\l/DirectiveHandlerResultInterface.h",height=0.2,width=0.4,color="black", fillcolor="white", style="filled",URL="$_directive_handler_result_interface_8h.html"];
  Node28 -> Node2 [color="midnightblue",fontsize="10",style="solid",fontname="Helvetica"];
  Node28 -> Node18 [color="midnightblue",fontsize="10",style="solid",fontname="Helvetica"];
  Node4 -> Node28 [color="midnightblue",fontsize="10",style="solid",fontname="Helvetica"];
  Node1 -> Node29 [color="midnightblue",fontsize="10",style="solid",fontname="Helvetica"];
  Node29 [label="AVSCommon/AVS/Capability\lConfiguration.h",height=0.2,width=0.4,color="black", fillcolor="white", style="filled",URL="$_capability_configuration_8h.html"];
  Node29 -> Node7 [color="midnightblue",fontsize="10",style="solid",fontname="Helvetica"];
  Node29 -> Node6 [color="midnightblue",fontsize="10",style="solid",fontname="Helvetica"];
  Node1 -> Node30 [color="midnightblue",fontsize="10",style="solid",fontname="Helvetica"];
  Node30 [label="AVSCommon/SDKInterfaces\l/Audio/NotificationsAudioFactory\lInterface.h",height=0.2,width=0.4,color="black", fillcolor="white", style="filled",URL="$_notifications_audio_factory_interface_8h.html"];
  Node30 -> Node31 [color="midnightblue",fontsize="10",style="solid",fontname="Helvetica"];
  Node31 [label="istream",height=0.2,width=0.4,color="grey75", fillcolor="white", style="filled"];
  Node30 -> Node32 [color="midnightblue",fontsize="10",style="solid",fontname="Helvetica"];
  Node32 [label="functional",height=0.2,width=0.4,color="grey75", fillcolor="white", style="filled"];
  Node30 -> Node2 [color="midnightblue",fontsize="10",style="solid",fontname="Helvetica"];
  Node1 -> Node33 [color="midnightblue",fontsize="10",style="solid",fontname="Helvetica"];
  Node33 [label="AVSCommon/SDKInterfaces\l/CapabilityConfigurationInterface.h",height=0.2,width=0.4,color="black", fillcolor="white", style="filled",URL="$_capability_configuration_interface_8h.html"];
  Node33 -> Node2 [color="midnightblue",fontsize="10",style="solid",fontname="Helvetica"];
  Node33 -> Node3 [color="midnightblue",fontsize="10",style="solid",fontname="Helvetica"];
  Node33 -> Node29 [color="midnightblue",fontsize="10",style="solid",fontname="Helvetica"];
  Node1 -> Node34 [color="midnightblue",fontsize="10",style="solid",fontname="Helvetica"];
  Node34 [label="AVSCommon/SDKInterfaces\l/ContextManagerInterface.h",height=0.2,width=0.4,color="black", fillcolor="white", style="filled",URL="$_context_manager_interface_8h.html"];
  Node34 -> Node2 [color="midnightblue",fontsize="10",style="solid",fontname="Helvetica"];
  Node34 -> Node14 [color="midnightblue",fontsize="10",style="solid",fontname="Helvetica"];
  Node34 -> Node16 [color="midnightblue",fontsize="10",style="solid",fontname="Helvetica"];
  Node34 -> Node35 [color="midnightblue",fontsize="10",style="solid",fontname="Helvetica"];
  Node35 [label="AVSCommon/AVS/StateRefresh\lPolicy.h",height=0.2,width=0.4,color="black", fillcolor="white", style="filled",URL="$_state_refresh_policy_8h.html"];
  Node34 -> Node8 [color="midnightblue",fontsize="10",style="solid",fontname="Helvetica"];
  Node1 -> Node36 [color="midnightblue",fontsize="10",style="solid",fontname="Helvetica"];
  Node36 [label="AVSCommon/SDKInterfaces\l/NotificationsObserverInterface.h",height=0.2,width=0.4,color="black", fillcolor="white", style="filled",URL="$_notifications_observer_interface_8h.html"];
  Node36 -> Node37 [color="midnightblue",fontsize="10",style="solid",fontname="Helvetica"];
  Node37 [label="AVSCommon/AVS/IndicatorState.h",height=0.2,width=0.4,color="black", fillcolor="white", style="filled",URL="$_a_v_s_common_2_a_v_s_2include_2_a_v_s_common_2_a_v_s_2_indicator_state_8h.html"];
  Node37 -> Node15 [color="midnightblue",fontsize="10",style="solid",fontname="Helvetica"];
  Node1 -> Node38 [color="midnightblue",fontsize="10",style="solid",fontname="Helvetica"];
  Node38 [label="AVSCommon/Utils/Requires\lShutdown.h",height=0.2,width=0.4,color="black", fillcolor="white", style="filled",URL="$_requires_shutdown_8h.html"];
  Node38 -> Node5 [color="midnightblue",fontsize="10",style="solid",fontname="Helvetica"];
  Node38 -> Node2 [color="midnightblue",fontsize="10",style="solid",fontname="Helvetica"];
  Node38 -> Node23 [color="midnightblue",fontsize="10",style="solid",fontname="Helvetica"];
  Node38 -> Node7 [color="midnightblue",fontsize="10",style="solid",fontname="Helvetica"];
  Node1 -> Node39 [color="midnightblue",fontsize="10",style="solid",fontname="Helvetica"];
  Node39 [label="AVSCommon/Utils/Threading\l/Executor.h",height=0.2,width=0.4,color="black", fillcolor="white", style="filled",URL="$_executor_8h.html"];
  Node39 -> Node5 [color="midnightblue",fontsize="10",style="solid",fontname="Helvetica"];
  Node39 -> Node40 [color="midnightblue",fontsize="10",style="solid",fontname="Helvetica"];
  Node40 [label="condition_variable",height=0.2,width=0.4,color="grey75", fillcolor="white", style="filled"];
  Node39 -> Node21 [color="midnightblue",fontsize="10",style="solid",fontname="Helvetica"];
  Node39 -> Node41 [color="midnightblue",fontsize="10",style="solid",fontname="Helvetica"];
  Node41 [label="deque",height=0.2,width=0.4,color="grey75", fillcolor="white", style="filled"];
  Node39 -> Node32 [color="midnightblue",fontsize="10",style="solid",fontname="Helvetica"];
  Node39 -> Node42 [color="midnightblue",fontsize="10",style="solid",fontname="Helvetica"];
  Node42 [label="future",height=0.2,width=0.4,color="grey75", fillcolor="white", style="filled"];
  Node39 -> Node2 [color="midnightblue",fontsize="10",style="solid",fontname="Helvetica"];
  Node39 -> Node23 [color="midnightblue",fontsize="10",style="solid",fontname="Helvetica"];
  Node39 -> Node19 [color="midnightblue",fontsize="10",style="solid",fontname="Helvetica"];
  Node39 -> Node43 [color="midnightblue",fontsize="10",style="solid",fontname="Helvetica"];
  Node43 [label="AVSCommon/Utils/Threading\l/TaskThread.h",height=0.2,width=0.4,color="black", fillcolor="white", style="filled",URL="$_task_thread_8h.html"];
  Node43 -> Node5 [color="midnightblue",fontsize="10",style="solid",fontname="Helvetica"];
  Node43 -> Node32 [color="midnightblue",fontsize="10",style="solid",fontname="Helvetica"];
  Node43 -> Node7 [color="midnightblue",fontsize="10",style="solid",fontname="Helvetica"];
  Node43 -> Node44 [color="midnightblue",fontsize="10",style="solid",fontname="Helvetica"];
  Node44 [label="thread",height=0.2,width=0.4,color="grey75", fillcolor="white", style="filled"];
  Node1 -> Node45 [color="midnightblue",fontsize="10",style="solid",fontname="Helvetica"];
  Node45 [label="RegistrationManager\l/CustomerDataHandler.h",height=0.2,width=0.4,color="black", fillcolor="white", style="filled",URL="$_customer_data_handler_8h.html"];
  Node45 -> Node2 [color="midnightblue",fontsize="10",style="solid",fontname="Helvetica"];
  Node1 -> Node46 [color="midnightblue",fontsize="10",style="solid",fontname="Helvetica"];
  Node46 [label="NotificationIndicator.h",height=0.2,width=0.4,color="black", fillcolor="white", style="filled",URL="$_notification_indicator_8h.html"];
  Node46 -> Node7 [color="midnightblue",fontsize="10",style="solid",fontname="Helvetica"];
  Node1 -> Node47 [color="midnightblue",fontsize="10",style="solid",fontname="Helvetica"];
  Node47 [label="NotificationRendererInterface.h",height=0.2,width=0.4,color="black", fillcolor="white", style="filled",URL="$_notification_renderer_interface_8h.html"];
  Node47 -> Node11 [color="midnightblue",fontsize="10",style="solid",fontname="Helvetica"];
  Node47 -> Node2 [color="midnightblue",fontsize="10",style="solid",fontname="Helvetica"];
  Node47 -> Node7 [color="midnightblue",fontsize="10",style="solid",fontname="Helvetica"];
  Node47 -> Node48 [color="midnightblue",fontsize="10",style="solid",fontname="Helvetica"];
  Node48 [label="NotificationRendererObserver\lInterface.h",height=0.2,width=0.4,color="black", fillcolor="white", style="filled",URL="$_notification_renderer_observer_interface_8h.html"];
  Node1 -> Node48 [color="midnightblue",fontsize="10",style="solid",fontname="Helvetica"];
  Node1 -> Node49 [color="midnightblue",fontsize="10",style="solid",fontname="Helvetica"];
  Node49 [label="NotificationsStorageInterface.h",height=0.2,width=0.4,color="black", fillcolor="white", style="filled",URL="$_notifications_storage_interface_8h.html"];
  Node49 -> Node37 [color="midnightblue",fontsize="10",style="solid",fontname="Helvetica"];
  Node49 -> Node46 [color="midnightblue",fontsize="10",style="solid",fontname="Helvetica"];
  Node1 -> Node50 [color="midnightblue",fontsize="10",style="solid",fontname="Helvetica"];
  Node50 [label="NotificationsCapabilityAgent\lState.h",height=0.2,width=0.4,color="black", fillcolor="white", style="filled",URL="$_notifications_capability_agent_state_8h.html"];
  Node50 -> Node15 [color="midnightblue",fontsize="10",style="solid",fontname="Helvetica"];
  Node50 -> Node7 [color="midnightblue",fontsize="10",style="solid",fontname="Helvetica"];
}
