digraph "/workplace/avs-device-sdk/AVSCommon/Utils/include/AVSCommon/Utils/Logger/SinkObserverInterface.h"
{
  edge [fontname="Helvetica",fontsize="10",labelfontname="Helvetica",labelfontsize="10"];
  node [fontname="Helvetica",fontsize="10",shape=record];
  Node1 [label="/workplace/avs-device\l-sdk/AVSCommon/Utils\l/include/AVSCommon/Utils\l/Logger/SinkObserverInterface.h",height=0.2,width=0.4,color="black", fillcolor="grey75", style="filled", fontcolor="black"];
  Node1 -> Node2 [dir="back",color="midnightblue",fontsize="10",style="solid",fontname="Helvetica"];
  Node2 [label="/workplace/avs-device\l-sdk/AVSCommon/Utils\l/include/AVSCommon/Utils\l/Logger/Logger.h",height=0.2,width=0.4,color="red", fillcolor="white", style="filled",URL="$_logger_8h.html"];
  Node2 -> Node3 [dir="back",color="midnightblue",fontsize="10",style="solid",fontname="Helvetica"];
  Node3 [label="/workplace/avs-device\l-sdk/ACL/src/AVSConnectionManager.cpp",height=0.2,width=0.4,color="black", fillcolor="white", style="filled",URL="$_a_v_s_connection_manager_8cpp.html"];
  Node2 -> Node4 [dir="back",color="midnightblue",fontsize="10",style="solid",fontname="Helvetica"];
  Node4 [label="/workplace/avs-device\l-sdk/ACL/src/Transport\l/DownchannelHandler.cpp",height=0.2,width=0.4,color="black", fillcolor="white", style="filled",URL="$_downchannel_handler_8cpp.html"];
  Node2 -> Node5 [dir="back",color="midnightblue",fontsize="10",style="solid",fontname="Helvetica"];
  Node5 [label="/workplace/avs-device\l-sdk/ACL/src/Transport\l/ExchangeHandler.cpp",height=0.2,width=0.4,color="black", fillcolor="white", style="filled",URL="$_exchange_handler_8cpp.html"];
  Node2 -> Node6 [dir="back",color="midnightblue",fontsize="10",style="solid",fontname="Helvetica"];
  Node6 [label="/workplace/avs-device\l-sdk/ACL/src/Transport\l/HTTP2Transport.cpp",height=0.2,width=0.4,color="black", fillcolor="white", style="filled",URL="$_h_t_t_p2_transport_8cpp.html"];
  Node2 -> Node7 [dir="back",color="midnightblue",fontsize="10",style="solid",fontname="Helvetica"];
  Node7 [label="/workplace/avs-device\l-sdk/ACL/src/Transport\l/MessageRequestHandler.cpp",height=0.2,width=0.4,color="black", fillcolor="white", style="filled",URL="$_message_request_handler_8cpp.html"];
  Node2 -> Node8 [dir="back",color="midnightblue",fontsize="10",style="solid",fontname="Helvetica"];
  Node8 [label="/workplace/avs-device\l-sdk/ACL/src/Transport\l/MessageRouter.cpp",height=0.2,width=0.4,color="black", fillcolor="white", style="filled",URL="$_message_router_8cpp.html"];
  Node2 -> Node9 [dir="back",color="midnightblue",fontsize="10",style="solid",fontname="Helvetica"];
  Node9 [label="/workplace/avs-device\l-sdk/ACL/src/Transport\l/MimeResponseSink.cpp",height=0.2,width=0.4,color="black", fillcolor="white", style="filled",URL="$_mime_response_sink_8cpp.html"];
  Node2 -> Node10 [dir="back",color="midnightblue",fontsize="10",style="solid",fontname="Helvetica"];
  Node10 [label="/workplace/avs-device\l-sdk/ACL/src/Transport\l/PingHandler.cpp",height=0.2,width=0.4,color="black", fillcolor="white", style="filled",URL="$_ping_handler_8cpp.html"];
  Node2 -> Node11 [dir="back",color="midnightblue",fontsize="10",style="solid",fontname="Helvetica"];
  Node11 [label="/workplace/avs-device\l-sdk/ACL/src/Transport\l/PostConnectSynchronizer.cpp",height=0.2,width=0.4,color="black", fillcolor="white", style="filled",URL="$_post_connect_synchronizer_8cpp.html"];
  Node2 -> Node12 [dir="back",color="midnightblue",fontsize="10",style="solid",fontname="Helvetica"];
  Node12 [label="/workplace/avs-device\l-sdk/ACL/src/Transport\l/PostConnectSynchronizerFactory.cpp",height=0.2,width=0.4,color="black", fillcolor="white", style="filled",URL="$_post_connect_synchronizer_factory_8cpp.html"];
  Node2 -> Node13 [dir="back",color="midnightblue",fontsize="10",style="solid",fontname="Helvetica"];
  Node13 [label="/workplace/avs-device\l-sdk/ADSL/src/DirectiveProcessor.cpp",height=0.2,width=0.4,color="black", fillcolor="white", style="filled",URL="$_directive_processor_8cpp.html"];
  Node2 -> Node14 [dir="back",color="midnightblue",fontsize="10",style="solid",fontname="Helvetica"];
  Node14 [label="/workplace/avs-device\l-sdk/ADSL/src/DirectiveRouter.cpp",height=0.2,width=0.4,color="black", fillcolor="white", style="filled",URL="$_directive_router_8cpp.html"];
  Node2 -> Node15 [dir="back",color="midnightblue",fontsize="10",style="solid",fontname="Helvetica"];
  Node15 [label="/workplace/avs-device\l-sdk/ADSL/src/DirectiveSequencer.cpp",height=0.2,width=0.4,color="black", fillcolor="white", style="filled",URL="$_directive_sequencer_8cpp.html"];
  Node2 -> Node16 [dir="back",color="midnightblue",fontsize="10",style="solid",fontname="Helvetica"];
  Node16 [label="/workplace/avs-device\l-sdk/ADSL/src/MessageInterpreter.cpp",height=0.2,width=0.4,color="black", fillcolor="white", style="filled",URL="$_message_interpreter_8cpp.html"];
  Node2 -> Node17 [dir="back",color="midnightblue",fontsize="10",style="solid",fontname="Helvetica"];
  Node17 [label="/workplace/avs-device\l-sdk/AFML/src/AudioActivity\lTracker.cpp",height=0.2,width=0.4,color="black", fillcolor="white", style="filled",URL="$_audio_activity_tracker_8cpp.html"];
  Node2 -> Node18 [dir="back",color="midnightblue",fontsize="10",style="solid",fontname="Helvetica"];
  Node18 [label="/workplace/avs-device\l-sdk/AFML/src/FocusManager.cpp",height=0.2,width=0.4,color="black", fillcolor="white", style="filled",URL="$_focus_manager_8cpp.html"];
  Node2 -> Node19 [dir="back",color="midnightblue",fontsize="10",style="solid",fontname="Helvetica"];
  Node19 [label="/workplace/avs-device\l-sdk/AFML/src/VisualActivity\lTracker.cpp",height=0.2,width=0.4,color="black", fillcolor="white", style="filled",URL="$_visual_activity_tracker_8cpp.html"];
  Node2 -> Node20 [dir="back",color="midnightblue",fontsize="10",style="solid",fontname="Helvetica"];
  Node20 [label="/workplace/avs-device\l-sdk/ApplicationUtilities\l/AndroidUtilities/include\l/AndroidUtilities/AndroidLogger.h",height=0.2,width=0.4,color="red", fillcolor="white", style="filled",URL="$_android_logger_8h.html"];
  Node2 -> Node21 [dir="back",color="midnightblue",fontsize="10",style="solid",fontname="Helvetica"];
  Node21 [label="/workplace/avs-device\l-sdk/ApplicationUtilities\l/AndroidUtilities/include\l/AndroidUtilities/AndroidSLESObject.h",height=0.2,width=0.4,color="red", fillcolor="white", style="filled",URL="$_android_s_l_e_s_object_8h.html"];
  Node2 -> Node22 [dir="back",color="midnightblue",fontsize="10",style="solid",fontname="Helvetica"];
  Node22 [label="/workplace/avs-device\l-sdk/ApplicationUtilities\l/DefaultClient/src/EqualizerRuntime\lSetup.cpp",height=0.2,width=0.4,color="black", fillcolor="white", style="filled",URL="$_equalizer_runtime_setup_8cpp.html"];
  Node2 -> Node23 [dir="back",color="midnightblue",fontsize="10",style="solid",fontname="Helvetica"];
  Node23 [label="/workplace/avs-device\l-sdk/AVSCommon/AVS/src\l/AbstractAVSConnectionManager.cpp",height=0.2,width=0.4,color="black", fillcolor="white", style="filled",URL="$_abstract_a_v_s_connection_manager_8cpp.html"];
  Node2 -> Node24 [dir="back",color="midnightblue",fontsize="10",style="solid",fontname="Helvetica"];
  Node24 [label="/workplace/avs-device\l-sdk/AVSCommon/AVS/src\l/AlexaClientSDKInit.cpp",height=0.2,width=0.4,color="black", fillcolor="white", style="filled",URL="$_alexa_client_s_d_k_init_8cpp.html"];
  Node2 -> Node25 [dir="back",color="midnightblue",fontsize="10",style="solid",fontname="Helvetica"];
  Node25 [label="/workplace/avs-device\l-sdk/AVSCommon/AVS/src\l/Attachment/AttachmentManager.cpp",height=0.2,width=0.4,color="black", fillcolor="white", style="filled",URL="$_attachment_manager_8cpp.html"];
  Node2 -> Node26 [dir="back",color="midnightblue",fontsize="10",style="solid",fontname="Helvetica"];
  Node26 [label="/workplace/avs-device\l-sdk/AVSCommon/AVS/src\l/Attachment/AttachmentUtils.cpp",height=0.2,width=0.4,color="black", fillcolor="white", style="filled",URL="$_attachment_utils_8cpp.html"];
  Node2 -> Node27 [dir="back",color="midnightblue",fontsize="10",style="solid",fontname="Helvetica"];
  Node27 [label="/workplace/avs-device\l-sdk/AVSCommon/AVS/src\l/Attachment/InProcessAttachment\lReader.cpp",height=0.2,width=0.4,color="black", fillcolor="white", style="filled",URL="$_in_process_attachment_reader_8cpp.html"];
  Node2 -> Node28 [dir="back",color="midnightblue",fontsize="10",style="solid",fontname="Helvetica"];
  Node28 [label="/workplace/avs-device\l-sdk/AVSCommon/AVS/src\l/Attachment/InProcessAttachment\lWriter.cpp",height=0.2,width=0.4,color="black", fillcolor="white", style="filled",URL="$_in_process_attachment_writer_8cpp.html"];
  Node2 -> Node29 [dir="back",color="midnightblue",fontsize="10",style="solid",fontname="Helvetica"];
  Node29 [label="/workplace/avs-device\l-sdk/AVSCommon/AVS/src\l/AVSDirective.cpp",height=0.2,width=0.4,color="black", fillcolor="white", style="filled",URL="$_a_v_s_directive_8cpp.html"];
  Node2 -> Node30 [dir="back",color="midnightblue",fontsize="10",style="solid",fontname="Helvetica"];
  Node30 [label="/workplace/avs-device\l-sdk/AVSCommon/AVS/src\l/BlockingPolicy.cpp",height=0.2,width=0.4,color="black", fillcolor="white", style="filled",URL="$_blocking_policy_8cpp.html"];
  Node2 -> Node31 [dir="back",color="midnightblue",fontsize="10",style="solid",fontname="Helvetica"];
  Node31 [label="/workplace/avs-device\l-sdk/AVSCommon/AVS/src\l/CapabilityAgent.cpp",height=0.2,width=0.4,color="black", fillcolor="white", style="filled",URL="$_capability_agent_8cpp.html"];
  Node2 -> Node32 [dir="back",color="midnightblue",fontsize="10",style="solid",fontname="Helvetica"];
  Node32 [label="/workplace/avs-device\l-sdk/AVSCommon/AVS/src\l/EventBuilder.cpp",height=0.2,width=0.4,color="black", fillcolor="white", style="filled",URL="$_event_builder_8cpp.html"];
  Node2 -> Node33 [dir="back",color="midnightblue",fontsize="10",style="solid",fontname="Helvetica"];
  Node33 [label="/workplace/avs-device\l-sdk/AVSCommon/AVS/src\l/ExceptionEncounteredSender.cpp",height=0.2,width=0.4,color="black", fillcolor="white", style="filled",URL="$_exception_encountered_sender_8cpp.html"];
  Node2 -> Node34 [dir="back",color="midnightblue",fontsize="10",style="solid",fontname="Helvetica"];
  Node34 [label="/workplace/avs-device\l-sdk/AVSCommon/AVS/src\l/MessageRequest.cpp",height=0.2,width=0.4,color="black", fillcolor="white", style="filled",URL="$_message_request_8cpp.html"];
  Node2 -> Node35 [dir="back",color="midnightblue",fontsize="10",style="solid",fontname="Helvetica"];
  Node35 [label="/workplace/avs-device\l-sdk/AVSCommon/Utils\l/include/AVSCommon/Utils\l/Logger/ConsoleLogger.h",height=0.2,width=0.4,color="red", fillcolor="white", style="filled",URL="$_console_logger_8h.html"];
  Node2 -> Node36 [dir="back",color="midnightblue",fontsize="10",style="solid",fontname="Helvetica"];
  Node36 [label="/workplace/avs-device\l-sdk/AVSCommon/Utils\l/include/AVSCommon/Utils\l/Logger/LoggerSinkManager.h",height=0.2,width=0.4,color="red", fillcolor="white", style="filled",URL="$_logger_sink_manager_8h.html"];
  Node2 -> Node37 [dir="back",color="midnightblue",fontsize="10",style="solid",fontname="Helvetica"];
  Node37 [label="/workplace/avs-device\l-sdk/AVSCommon/Utils\l/include/AVSCommon/Utils\l/Logger/LoggerUtils.h",height=0.2,width=0.4,color="red", fillcolor="white", style="filled",URL="$_logger_utils_8h.html"];
  Node37 -> Node21 [dir="back",color="midnightblue",fontsize="10",style="solid",fontname="Helvetica"];
  Node37 -> Node35 [dir="back",color="midnightblue",fontsize="10",style="solid",fontname="Helvetica"];
  Node2 -> Node38 [dir="back",color="midnightblue",fontsize="10",style="solid",fontname="Helvetica"];
  Node38 [label="/workplace/avs-device\l-sdk/AVSCommon/Utils\l/include/AVSCommon/Utils\l/Logger/LogStringFormatter.h",height=0.2,width=0.4,color="red", fillcolor="white", style="filled",URL="$_log_string_formatter_8h.html"];
  Node38 -> Node20 [dir="back",color="midnightblue",fontsize="10",style="solid",fontname="Helvetica"];
  Node38 -> Node35 [dir="back",color="midnightblue",fontsize="10",style="solid",fontname="Helvetica"];
  Node2 -> Node39 [dir="back",color="midnightblue",fontsize="10",style="solid",fontname="Helvetica"];
  Node39 [label="/workplace/avs-device\l-sdk/AVSCommon/Utils\l/include/AVSCommon/Utils\l/Logger/ModuleLogger.h",height=0.2,width=0.4,color="black", fillcolor="white", style="filled",URL="$_module_logger_8h.html"];
  Node2 -> Node40 [dir="back",color="midnightblue",fontsize="10",style="solid",fontname="Helvetica"];
  Node40 [label="/workplace/avs-device\l-sdk/AVSCommon/Utils\l/src/BluetoothEventBus.cpp",height=0.2,width=0.4,color="black", fillcolor="white", style="filled",URL="$_bluetooth_event_bus_8cpp.html"];
  Node2 -> Node41 [dir="back",color="midnightblue",fontsize="10",style="solid",fontname="Helvetica"];
  Node41 [label="/workplace/avs-device\l-sdk/AVSCommon/Utils\l/src/Configuration/Configuration\lNode.cpp",height=0.2,width=0.4,color="black", fillcolor="white", style="filled",URL="$_configuration_node_8cpp.html"];
  Node2 -> Node42 [dir="back",color="midnightblue",fontsize="10",style="solid",fontname="Helvetica"];
  Node42 [label="/workplace/avs-device\l-sdk/AVSCommon/Utils\l/src/DeviceInfo.cpp",height=0.2,width=0.4,color="black", fillcolor="white", style="filled",URL="$_device_info_8cpp.html"];
  Node2 -> Node43 [dir="back",color="midnightblue",fontsize="10",style="solid",fontname="Helvetica"];
  Node43 [label="/workplace/avs-device\l-sdk/AVSCommon/Utils\l/src/FileUtils.cpp",height=0.2,width=0.4,color="black", fillcolor="white", style="filled",URL="$_file_utils_8cpp.html"];
  Node2 -> Node44 [dir="back",color="midnightblue",fontsize="10",style="solid",fontname="Helvetica"];
  Node44 [label="/workplace/avs-device\l-sdk/AVSCommon/Utils\l/src/FormattedAudioStreamAdapter.cpp",height=0.2,width=0.4,color="black", fillcolor="white", style="filled",URL="$_formatted_audio_stream_adapter_8cpp.html"];
  Node2 -> Node45 [dir="back",color="midnightblue",fontsize="10",style="solid",fontname="Helvetica"];
  Node45 [label="/workplace/avs-device\l-sdk/AVSCommon/Utils\l/src/HTTP2/HTTP2MimeRequestEncoder.cpp",height=0.2,width=0.4,color="black", fillcolor="white", style="filled",URL="$_h_t_t_p2_mime_request_encoder_8cpp.html"];
  Node2 -> Node46 [dir="back",color="midnightblue",fontsize="10",style="solid",fontname="Helvetica"];
  Node46 [label="/workplace/avs-device\l-sdk/AVSCommon/Utils\l/src/HTTP2/HTTP2MimeResponse\lDecoder.cpp",height=0.2,width=0.4,color="black", fillcolor="white", style="filled",URL="$_h_t_t_p2_mime_response_decoder_8cpp.html"];
  Node2 -> Node47 [dir="back",color="midnightblue",fontsize="10",style="solid",fontname="Helvetica"];
  Node47 [label="/workplace/avs-device\l-sdk/AVSCommon/Utils\l/src/JSON/JSONGenerator.cpp",height=0.2,width=0.4,color="black", fillcolor="white", style="filled",URL="$_j_s_o_n_generator_8cpp.html"];
  Node2 -> Node48 [dir="back",color="midnightblue",fontsize="10",style="solid",fontname="Helvetica"];
  Node48 [label="/workplace/avs-device\l-sdk/AVSCommon/Utils\l/src/JSON/JSONUtils.cpp",height=0.2,width=0.4,color="black", fillcolor="white", style="filled",URL="$_j_s_o_n_utils_8cpp.html"];
  Node2 -> Node49 [dir="back",color="midnightblue",fontsize="10",style="solid",fontname="Helvetica"];
  Node49 [label="/workplace/avs-device\l-sdk/AVSCommon/Utils\l/src/LibcurlUtils/CallbackData.cpp",height=0.2,width=0.4,color="black", fillcolor="white", style="filled",URL="$_callback_data_8cpp.html"];
  Node2 -> Node50 [dir="back",color="midnightblue",fontsize="10",style="solid",fontname="Helvetica"];
  Node50 [label="/workplace/avs-device\l-sdk/AVSCommon/Utils\l/src/LibcurlUtils/CurlEasyHandle\lWrapper.cpp",height=0.2,width=0.4,color="black", fillcolor="white", style="filled",URL="$_curl_easy_handle_wrapper_8cpp.html"];
}
