digraph "/workplace/avs-device-sdk/AVSCommon/Utils/include/AVSCommon/Utils/Logger/LogEntryBuffer.h"
{
  edge [fontname="Helvetica",fontsize="10",labelfontname="Helvetica",labelfontsize="10"];
  node [fontname="Helvetica",fontsize="10",shape=record];
  Node1 [label="/workplace/avs-device\l-sdk/AVSCommon/Utils\l/include/AVSCommon/Utils\l/Logger/LogEntryBuffer.h",height=0.2,width=0.4,color="black", fillcolor="grey75", style="filled", fontcolor="black"];
  Node1 -> Node2 [dir="back",color="midnightblue",fontsize="10",style="solid",fontname="Helvetica"];
  Node2 [label="/workplace/avs-device\l-sdk/AVSCommon/Utils\l/include/AVSCommon/Utils\l/Logger/LogEntryStream.h",height=0.2,width=0.4,color="black", fillcolor="white", style="filled",URL="$_log_entry_stream_8h.html"];
  Node2 -> Node3 [dir="back",color="midnightblue",fontsize="10",style="solid",fontname="Helvetica"];
  Node3 [label="/workplace/avs-device\l-sdk/AVSCommon/Utils\l/include/AVSCommon/Utils\l/Logger/LogEntry.h",height=0.2,width=0.4,color="black", fillcolor="white", style="filled",URL="$_log_entry_8h.html"];
  Node3 -> Node4 [dir="back",color="midnightblue",fontsize="10",style="solid",fontname="Helvetica"];
  Node4 [label="/workplace/avs-device\l-sdk/AVSCommon/AVS/src\l/EventBuilder.cpp",height=0.2,width=0.4,color="black", fillcolor="white", style="filled",URL="$_event_builder_8cpp.html"];
  Node3 -> Node5 [dir="back",color="midnightblue",fontsize="10",style="solid",fontname="Helvetica"];
  Node5 [label="/workplace/avs-device\l-sdk/AVSCommon/Utils\l/include/AVSCommon/Utils\l/LibcurlUtils/CurlEasyHandleWrapper.h",height=0.2,width=0.4,color="black", fillcolor="white", style="filled",URL="$_curl_easy_handle_wrapper_8h.html"];
  Node5 -> Node6 [dir="back",color="midnightblue",fontsize="10",style="solid",fontname="Helvetica"];
  Node6 [label="/workplace/avs-device\l-sdk/AVSCommon/Utils\l/include/AVSCommon/Utils\l/LibcurlUtils/HttpPost.h",height=0.2,width=0.4,color="red", fillcolor="white", style="filled",URL="$_http_post_8h.html"];
  Node5 -> Node7 [dir="back",color="midnightblue",fontsize="10",style="solid",fontname="Helvetica"];
  Node7 [label="/workplace/avs-device\l-sdk/AVSCommon/Utils\l/include/AVSCommon/Utils\l/LibcurlUtils/HttpPut.h",height=0.2,width=0.4,color="red", fillcolor="white", style="filled",URL="$_http_put_8h.html"];
  Node5 -> Node8 [dir="back",color="midnightblue",fontsize="10",style="solid",fontname="Helvetica"];
  Node8 [label="/workplace/avs-device\l-sdk/AVSCommon/Utils\l/include/AVSCommon/Utils\l/LibcurlUtils/LibcurlHTTP2Request.h",height=0.2,width=0.4,color="red", fillcolor="white", style="filled",URL="$_libcurl_h_t_t_p2_request_8h.html"];
  Node8 -> Node9 [dir="back",color="midnightblue",fontsize="10",style="solid",fontname="Helvetica"];
  Node9 [label="/workplace/avs-device\l-sdk/AVSCommon/Utils\l/src/LibcurlUtils/LibcurlHTTP2\lConnection.cpp",height=0.2,width=0.4,color="black", fillcolor="white", style="filled",URL="$_libcurl_h_t_t_p2_connection_8cpp.html"];
  Node5 -> Node10 [dir="back",color="midnightblue",fontsize="10",style="solid",fontname="Helvetica"];
  Node10 [label="/workplace/avs-device\l-sdk/AVSCommon/Utils\l/include/AVSCommon/Utils\l/LibcurlUtils/LibCurlHttpContent\lFetcher.h",height=0.2,width=0.4,color="red", fillcolor="white", style="filled",URL="$_lib_curl_http_content_fetcher_8h.html"];
  Node10 -> Node11 [dir="back",color="midnightblue",fontsize="10",style="solid",fontname="Helvetica"];
  Node11 [label="/workplace/avs-device\l-sdk/AVSCommon/Utils\l/src/LibcurlUtils/LibCurlHttp\lContentFetcher.cpp",height=0.2,width=0.4,color="black", fillcolor="white", style="filled",URL="$_lib_curl_http_content_fetcher_8cpp.html"];
  Node5 -> Node12 [dir="back",color="midnightblue",fontsize="10",style="solid",fontname="Helvetica"];
  Node12 [label="/workplace/avs-device\l-sdk/AVSCommon/Utils\l/src/LibcurlUtils/CurlEasyHandle\lWrapper.cpp",height=0.2,width=0.4,color="black", fillcolor="white", style="filled",URL="$_curl_easy_handle_wrapper_8cpp.html"];
  Node5 -> Node9 [dir="back",color="midnightblue",fontsize="10",style="solid",fontname="Helvetica"];
  Node5 -> Node11 [dir="back",color="midnightblue",fontsize="10",style="solid",fontname="Helvetica"];
  Node3 -> Node13 [dir="back",color="midnightblue",fontsize="10",style="solid",fontname="Helvetica"];
  Node13 [label="/workplace/avs-device\l-sdk/AVSCommon/Utils\l/include/AVSCommon/Utils\l/Logger/Logger.h",height=0.2,width=0.4,color="red", fillcolor="white", style="filled",URL="$_logger_8h.html"];
  Node13 -> Node14 [dir="back",color="midnightblue",fontsize="10",style="solid",fontname="Helvetica"];
  Node14 [label="/workplace/avs-device\l-sdk/ACL/src/AVSConnectionManager.cpp",height=0.2,width=0.4,color="black", fillcolor="white", style="filled",URL="$_a_v_s_connection_manager_8cpp.html"];
  Node13 -> Node15 [dir="back",color="midnightblue",fontsize="10",style="solid",fontname="Helvetica"];
  Node15 [label="/workplace/avs-device\l-sdk/ACL/src/Transport\l/DownchannelHandler.cpp",height=0.2,width=0.4,color="black", fillcolor="white", style="filled",URL="$_downchannel_handler_8cpp.html"];
  Node13 -> Node16 [dir="back",color="midnightblue",fontsize="10",style="solid",fontname="Helvetica"];
  Node16 [label="/workplace/avs-device\l-sdk/ACL/src/Transport\l/ExchangeHandler.cpp",height=0.2,width=0.4,color="black", fillcolor="white", style="filled",URL="$_exchange_handler_8cpp.html"];
  Node13 -> Node17 [dir="back",color="midnightblue",fontsize="10",style="solid",fontname="Helvetica"];
  Node17 [label="/workplace/avs-device\l-sdk/ACL/src/Transport\l/HTTP2Transport.cpp",height=0.2,width=0.4,color="black", fillcolor="white", style="filled",URL="$_h_t_t_p2_transport_8cpp.html"];
  Node13 -> Node18 [dir="back",color="midnightblue",fontsize="10",style="solid",fontname="Helvetica"];
  Node18 [label="/workplace/avs-device\l-sdk/ACL/src/Transport\l/MessageRequestHandler.cpp",height=0.2,width=0.4,color="black", fillcolor="white", style="filled",URL="$_message_request_handler_8cpp.html"];
  Node13 -> Node19 [dir="back",color="midnightblue",fontsize="10",style="solid",fontname="Helvetica"];
  Node19 [label="/workplace/avs-device\l-sdk/ACL/src/Transport\l/MessageRouter.cpp",height=0.2,width=0.4,color="black", fillcolor="white", style="filled",URL="$_message_router_8cpp.html"];
  Node13 -> Node20 [dir="back",color="midnightblue",fontsize="10",style="solid",fontname="Helvetica"];
  Node20 [label="/workplace/avs-device\l-sdk/ACL/src/Transport\l/MimeResponseSink.cpp",height=0.2,width=0.4,color="black", fillcolor="white", style="filled",URL="$_mime_response_sink_8cpp.html"];
  Node13 -> Node21 [dir="back",color="midnightblue",fontsize="10",style="solid",fontname="Helvetica"];
  Node21 [label="/workplace/avs-device\l-sdk/ACL/src/Transport\l/PingHandler.cpp",height=0.2,width=0.4,color="black", fillcolor="white", style="filled",URL="$_ping_handler_8cpp.html"];
  Node13 -> Node22 [dir="back",color="midnightblue",fontsize="10",style="solid",fontname="Helvetica"];
  Node22 [label="/workplace/avs-device\l-sdk/ACL/src/Transport\l/PostConnectSynchronizer.cpp",height=0.2,width=0.4,color="black", fillcolor="white", style="filled",URL="$_post_connect_synchronizer_8cpp.html"];
  Node13 -> Node23 [dir="back",color="midnightblue",fontsize="10",style="solid",fontname="Helvetica"];
  Node23 [label="/workplace/avs-device\l-sdk/ACL/src/Transport\l/PostConnectSynchronizerFactory.cpp",height=0.2,width=0.4,color="black", fillcolor="white", style="filled",URL="$_post_connect_synchronizer_factory_8cpp.html"];
  Node13 -> Node24 [dir="back",color="midnightblue",fontsize="10",style="solid",fontname="Helvetica"];
  Node24 [label="/workplace/avs-device\l-sdk/ADSL/src/DirectiveProcessor.cpp",height=0.2,width=0.4,color="black", fillcolor="white", style="filled",URL="$_directive_processor_8cpp.html"];
  Node13 -> Node25 [dir="back",color="midnightblue",fontsize="10",style="solid",fontname="Helvetica"];
  Node25 [label="/workplace/avs-device\l-sdk/ADSL/src/DirectiveRouter.cpp",height=0.2,width=0.4,color="black", fillcolor="white", style="filled",URL="$_directive_router_8cpp.html"];
  Node13 -> Node26 [dir="back",color="midnightblue",fontsize="10",style="solid",fontname="Helvetica"];
  Node26 [label="/workplace/avs-device\l-sdk/ADSL/src/DirectiveSequencer.cpp",height=0.2,width=0.4,color="black", fillcolor="white", style="filled",URL="$_directive_sequencer_8cpp.html"];
  Node13 -> Node27 [dir="back",color="midnightblue",fontsize="10",style="solid",fontname="Helvetica"];
  Node27 [label="/workplace/avs-device\l-sdk/ADSL/src/MessageInterpreter.cpp",height=0.2,width=0.4,color="black", fillcolor="white", style="filled",URL="$_message_interpreter_8cpp.html"];
  Node13 -> Node28 [dir="back",color="midnightblue",fontsize="10",style="solid",fontname="Helvetica"];
  Node28 [label="/workplace/avs-device\l-sdk/AFML/src/AudioActivity\lTracker.cpp",height=0.2,width=0.4,color="black", fillcolor="white", style="filled",URL="$_audio_activity_tracker_8cpp.html"];
  Node13 -> Node29 [dir="back",color="midnightblue",fontsize="10",style="solid",fontname="Helvetica"];
  Node29 [label="/workplace/avs-device\l-sdk/AFML/src/FocusManager.cpp",height=0.2,width=0.4,color="black", fillcolor="white", style="filled",URL="$_focus_manager_8cpp.html"];
  Node13 -> Node30 [dir="back",color="midnightblue",fontsize="10",style="solid",fontname="Helvetica"];
  Node30 [label="/workplace/avs-device\l-sdk/AFML/src/VisualActivity\lTracker.cpp",height=0.2,width=0.4,color="black", fillcolor="white", style="filled",URL="$_visual_activity_tracker_8cpp.html"];
  Node13 -> Node31 [dir="back",color="midnightblue",fontsize="10",style="solid",fontname="Helvetica"];
  Node31 [label="/workplace/avs-device\l-sdk/ApplicationUtilities\l/AndroidUtilities/include\l/AndroidUtilities/AndroidLogger.h",height=0.2,width=0.4,color="red", fillcolor="white", style="filled",URL="$_android_logger_8h.html"];
  Node13 -> Node32 [dir="back",color="midnightblue",fontsize="10",style="solid",fontname="Helvetica"];
  Node32 [label="/workplace/avs-device\l-sdk/ApplicationUtilities\l/AndroidUtilities/include\l/AndroidUtilities/AndroidSLESObject.h",height=0.2,width=0.4,color="red", fillcolor="white", style="filled",URL="$_android_s_l_e_s_object_8h.html"];
  Node13 -> Node33 [dir="back",color="midnightblue",fontsize="10",style="solid",fontname="Helvetica"];
  Node33 [label="/workplace/avs-device\l-sdk/ApplicationUtilities\l/DefaultClient/src/EqualizerRuntime\lSetup.cpp",height=0.2,width=0.4,color="black", fillcolor="white", style="filled",URL="$_equalizer_runtime_setup_8cpp.html"];
  Node13 -> Node34 [dir="back",color="midnightblue",fontsize="10",style="solid",fontname="Helvetica"];
  Node34 [label="/workplace/avs-device\l-sdk/AVSCommon/AVS/src\l/AbstractAVSConnectionManager.cpp",height=0.2,width=0.4,color="black", fillcolor="white", style="filled",URL="$_abstract_a_v_s_connection_manager_8cpp.html"];
  Node13 -> Node35 [dir="back",color="midnightblue",fontsize="10",style="solid",fontname="Helvetica"];
  Node35 [label="/workplace/avs-device\l-sdk/AVSCommon/AVS/src\l/AlexaClientSDKInit.cpp",height=0.2,width=0.4,color="black", fillcolor="white", style="filled",URL="$_alexa_client_s_d_k_init_8cpp.html"];
  Node13 -> Node36 [dir="back",color="midnightblue",fontsize="10",style="solid",fontname="Helvetica"];
  Node36 [label="/workplace/avs-device\l-sdk/AVSCommon/AVS/src\l/Attachment/AttachmentManager.cpp",height=0.2,width=0.4,color="black", fillcolor="white", style="filled",URL="$_attachment_manager_8cpp.html"];
  Node13 -> Node37 [dir="back",color="midnightblue",fontsize="10",style="solid",fontname="Helvetica"];
  Node37 [label="/workplace/avs-device\l-sdk/AVSCommon/AVS/src\l/Attachment/AttachmentUtils.cpp",height=0.2,width=0.4,color="black", fillcolor="white", style="filled",URL="$_attachment_utils_8cpp.html"];
  Node13 -> Node38 [dir="back",color="midnightblue",fontsize="10",style="solid",fontname="Helvetica"];
  Node38 [label="/workplace/avs-device\l-sdk/AVSCommon/AVS/src\l/Attachment/InProcessAttachment\lReader.cpp",height=0.2,width=0.4,color="black", fillcolor="white", style="filled",URL="$_in_process_attachment_reader_8cpp.html"];
  Node13 -> Node39 [dir="back",color="midnightblue",fontsize="10",style="solid",fontname="Helvetica"];
  Node39 [label="/workplace/avs-device\l-sdk/AVSCommon/AVS/src\l/Attachment/InProcessAttachment\lWriter.cpp",height=0.2,width=0.4,color="black", fillcolor="white", style="filled",URL="$_in_process_attachment_writer_8cpp.html"];
  Node13 -> Node4 [dir="back",color="midnightblue",fontsize="10",style="solid",fontname="Helvetica"];
  Node13 -> Node12 [dir="back",color="midnightblue",fontsize="10",style="solid",fontname="Helvetica"];
  Node13 -> Node9 [dir="back",color="midnightblue",fontsize="10",style="solid",fontname="Helvetica"];
  Node3 -> Node40 [dir="back",color="midnightblue",fontsize="10",style="solid",fontname="Helvetica"];
  Node40 [label="/workplace/avs-device\l-sdk/AVSCommon/Utils\l/include/AVSCommon/Utils\l/Metrics.h",height=0.2,width=0.4,color="red", fillcolor="white", style="filled",URL="$_metrics_8h.html"];
  Node40 -> Node26 [dir="back",color="midnightblue",fontsize="10",style="solid",fontname="Helvetica"];
  Node40 -> Node27 [dir="back",color="midnightblue",fontsize="10",style="solid",fontname="Helvetica"];
  Node40 -> Node4 [dir="back",color="midnightblue",fontsize="10",style="solid",fontname="Helvetica"];
  Node3 -> Node41 [dir="back",color="midnightblue",fontsize="10",style="solid",fontname="Helvetica"];
  Node41 [label="/workplace/avs-device\l-sdk/AVSCommon/Utils\l/src/Logger/LogEntry.cpp",height=0.2,width=0.4,color="black", fillcolor="white", style="filled",URL="$_log_entry_8cpp.html"];
  Node3 -> Node42 [dir="back",color="midnightblue",fontsize="10",style="solid",fontname="Helvetica"];
  Node42 [label="/workplace/avs-device\l-sdk/Integration/test\l/AlertsIntegrationTest.cpp",height=0.2,width=0.4,color="black", fillcolor="white", style="filled",URL="$_alerts_integration_test_8cpp.html"];
  Node3 -> Node43 [dir="back",color="midnightblue",fontsize="10",style="solid",fontname="Helvetica"];
  Node43 [label="/workplace/avs-device\l-sdk/Integration/test\l/AudioInputProcessorIntegration\lTest.cpp",height=0.2,width=0.4,color="black", fillcolor="white", style="filled",URL="$_audio_input_processor_integration_test_8cpp.html"];
  Node3 -> Node44 [dir="back",color="midnightblue",fontsize="10",style="solid",fontname="Helvetica"];
  Node44 [label="/workplace/avs-device\l-sdk/Integration/test\l/AudioPlayerIntegrationTest.cpp",height=0.2,width=0.4,color="black", fillcolor="white", style="filled",URL="$_audio_player_integration_test_8cpp.html"];
  Node3 -> Node45 [dir="back",color="midnightblue",fontsize="10",style="solid",fontname="Helvetica"];
  Node45 [label="/workplace/avs-device\l-sdk/Integration/test\l/SpeechSynthesizerIntegration\lTest.cpp",height=0.2,width=0.4,color="black", fillcolor="white", style="filled",URL="$_speech_synthesizer_integration_test_8cpp.html"];
  Node3 -> Node46 [dir="back",color="midnightblue",fontsize="10",style="solid",fontname="Helvetica"];
  Node46 [label="/workplace/avs-device\l-sdk/Settings/include\l/Settings/Setting.h",height=0.2,width=0.4,color="red", fillcolor="white", style="filled",URL="$_setting_8h.html"];
  Node3 -> Node47 [dir="back",color="midnightblue",fontsize="10",style="solid",fontname="Helvetica"];
  Node47 [label="/workplace/avs-device\l-sdk/Settings/include\l/Settings/SettingsManager.h",height=0.2,width=0.4,color="red", fillcolor="white", style="filled",URL="$_settings_manager_8h.html"];
  Node2 -> Node48 [dir="back",color="midnightblue",fontsize="10",style="solid",fontname="Helvetica"];
  Node48 [label="/workplace/avs-device\l-sdk/AVSCommon/Utils\l/src/Logger/LogEntryStream.cpp",height=0.2,width=0.4,color="black", fillcolor="white", style="filled",URL="$_log_entry_stream_8cpp.html"];
  Node2 -> Node49 [dir="back",color="midnightblue",fontsize="10",style="solid",fontname="Helvetica"];
  Node49 [label="/workplace/avs-device\l-sdk/AVSCommon/Utils\l/test/LogEntryStreamTest.cpp",height=0.2,width=0.4,color="black", fillcolor="white", style="filled",URL="$_log_entry_stream_test_8cpp.html"];
  Node1 -> Node50 [dir="back",color="midnightblue",fontsize="10",style="solid",fontname="Helvetica"];
  Node50 [label="/workplace/avs-device\l-sdk/AVSCommon/Utils\l/src/Logger/LogEntryBuffer.cpp",height=0.2,width=0.4,color="black", fillcolor="white", style="filled",URL="$_log_entry_buffer_8cpp.html"];
}
