digraph "/workplace/avs-device-sdk/AFML/include" {
  compound=true
  node [ fontsize="10", fontname="Helvetica"];
  edge [ labelfontsize="10", labelfontname="Helvetica"];
  subgraph clusterdir_15a1dcf98404372b5aa31671439f6987 {
    graph [ bgcolor="#ddddee", pencolor="black", label="AFML" fontname="Helvetica", fontsize="10", URL="dir_15a1dcf98404372b5aa31671439f6987.html"]
  subgraph clusterdir_275bd4c7f9218fea92087aadc583fdf2 {
    graph [ bgcolor="#eeeeff", pencolor="black", label="" URL="dir_275bd4c7f9218fea92087aadc583fdf2.html"];
    dir_275bd4c7f9218fea92087aadc583fdf2 [shape=plaintext label="include"];
    dir_f6d6b70c5306129e9516277034a058e2 [shape=box label="AFML" color="black" fillcolor="white" style="filled" URL="dir_f6d6b70c5306129e9516277034a058e2.html"];
  }
  }
  dir_13e65effb2bde530b17b3d5eefcd0266 [shape=box label="AVSCommon" fillcolor="white" style="filled" color="red" URL="dir_13e65effb2bde530b17b3d5eefcd0266.html"];
  dir_f6d6b70c5306129e9516277034a058e2->dir_13e65effb2bde530b17b3d5eefcd0266 [headlabel="17", labeldistance=1.5 headhref="dir_000023_000015.html"];
}
