digraph "alexaClientSDK::avsCommon::sdkInterfaces::HTTPContentFetcherInterface"
{
  edge [fontname="Helvetica",fontsize="10",labelfontname="Helvetica",labelfontsize="10"];
  node [fontname="Helvetica",fontsize="10",shape=record];
  rankdir="LR";
  Node1 [label="alexaClientSDK::avsCommon\l::sdkInterfaces::HTTPContentFetcher\lInterface",height=0.2,width=0.4,color="black", fillcolor="grey75", style="filled", fontcolor="black"];
  Node1 -> Node2 [dir="back",color="midnightblue",fontsize="10",style="solid",fontname="Helvetica"];
  Node2 [label="alexaClientSDK::avsCommon\l::utils::libcurlUtils::\lLibCurlHttpContentFetcher",height=0.2,width=0.4,color="black", fillcolor="white", style="filled",URL="$classalexa_client_s_d_k_1_1avs_common_1_1utils_1_1libcurl_utils_1_1_lib_curl_http_content_fetcher.html"];
  Node1 -> Node3 [dir="back",color="midnightblue",fontsize="10",style="solid",fontname="Helvetica"];
  Node3 [label="alexaClientSDK::mediaPlayer\l::test::MockContentFetcher",height=0.2,width=0.4,color="black", fillcolor="white", style="filled",URL="$classalexa_client_s_d_k_1_1media_player_1_1test_1_1_mock_content_fetcher.html",tooltip="A mock content fetcher. "];
  Node1 -> Node4 [dir="back",color="midnightblue",fontsize="10",style="solid",fontname="Helvetica"];
  Node4 [label="alexaClientSDK::playlist\lParser::test::MockContentFetcher",height=0.2,width=0.4,color="black", fillcolor="white", style="filled",URL="$classalexa_client_s_d_k_1_1playlist_parser_1_1test_1_1_mock_content_fetcher.html",tooltip="A mock content fetcher. "];
}
