digraph "alexaClientSDK::avsCommon::avs::DialogUXStateAggregator"
{
  edge [fontname="Helvetica",fontsize="10",labelfontname="Helvetica",labelfontsize="10"];
  node [fontname="Helvetica",fontsize="10",shape=record];
  rankdir="LR";
  Node1 [label="alexaClientSDK::avsCommon\l::avs::DialogUXStateAggregator",height=0.2,width=0.4,color="black", fillcolor="grey75", style="filled", fontcolor="black"];
  Node2 -> Node1 [dir="back",color="midnightblue",fontsize="10",style="solid",fontname="Helvetica"];
  Node2 [label="alexaClientSDK::avsCommon\l::sdkInterfaces::AudioInputProcessor\lObserverInterface",height=0.2,width=0.4,color="black", fillcolor="white", style="filled",URL="$classalexa_client_s_d_k_1_1avs_common_1_1sdk_interfaces_1_1_audio_input_processor_observer_interface.html",tooltip="A state observer for an AudioInputProcessor. "];
  Node3 -> Node1 [dir="back",color="midnightblue",fontsize="10",style="solid",fontname="Helvetica"];
  Node3 [label="alexaClientSDK::avsCommon\l::sdkInterfaces::SpeechSynthesizer\lObserverInterface",height=0.2,width=0.4,color="black", fillcolor="white", style="filled",URL="$classalexa_client_s_d_k_1_1avs_common_1_1sdk_interfaces_1_1_speech_synthesizer_observer_interface.html"];
  Node4 -> Node1 [dir="back",color="midnightblue",fontsize="10",style="solid",fontname="Helvetica"];
  Node4 [label="alexaClientSDK::avsCommon\l::sdkInterfaces::MessageObserver\lInterface",height=0.2,width=0.4,color="black", fillcolor="white", style="filled",URL="$classalexa_client_s_d_k_1_1avs_common_1_1sdk_interfaces_1_1_message_observer_interface.html"];
  Node5 -> Node1 [dir="back",color="midnightblue",fontsize="10",style="solid",fontname="Helvetica"];
  Node5 [label="alexaClientSDK::avsCommon\l::sdkInterfaces::ConnectionStatus\lObserverInterface",height=0.2,width=0.4,color="black", fillcolor="white", style="filled",URL="$classalexa_client_s_d_k_1_1avs_common_1_1sdk_interfaces_1_1_connection_status_observer_interface.html"];
}
