digraph "/workplace/avs-device-sdk/Settings/include/Settings/SettingCallbackAdapter.h"
{
  edge [fontname="Helvetica",fontsize="10",labelfontname="Helvetica",labelfontsize="10"];
  node [fontname="Helvetica",fontsize="10",shape=record];
  Node1 [label="/workplace/avs-device\l-sdk/Settings/include\l/Settings/SettingCallbackAdapter.h",height=0.2,width=0.4,color="black", fillcolor="grey75", style="filled", fontcolor="black"];
  Node1 -> Node2 [dir="back",color="midnightblue",fontsize="10",style="solid",fontname="Helvetica"];
  Node2 [label="/workplace/avs-device\l-sdk/Settings/include\l/Settings/SettingCallbacks.h",height=0.2,width=0.4,color="black", fillcolor="white", style="filled",URL="$_setting_callbacks_8h.html"];
  Node2 -> Node3 [dir="back",color="midnightblue",fontsize="10",style="solid",fontname="Helvetica"];
  Node3 [label="/workplace/avs-device\l-sdk/SampleApp/include\l/SampleApp/UIManager.h",height=0.2,width=0.4,color="black", fillcolor="white", style="filled",URL="$_u_i_manager_8h.html"];
  Node3 -> Node4 [dir="back",color="midnightblue",fontsize="10",style="solid",fontname="Helvetica"];
  Node4 [label="/workplace/avs-device\l-sdk/SampleApp/include\l/SampleApp/InteractionManager.h",height=0.2,width=0.4,color="black", fillcolor="white", style="filled",URL="$_interaction_manager_8h.html"];
  Node4 -> Node5 [dir="back",color="midnightblue",fontsize="10",style="solid",fontname="Helvetica"];
  Node5 [label="/workplace/avs-device\l-sdk/SampleApp/include\l/SampleApp/UserInputManager.h",height=0.2,width=0.4,color="black", fillcolor="white", style="filled",URL="$_user_input_manager_8h.html"];
  Node5 -> Node6 [dir="back",color="midnightblue",fontsize="10",style="solid",fontname="Helvetica"];
  Node6 [label="/workplace/avs-device\l-sdk/SampleApp/include\l/SampleApp/SampleApplication.h",height=0.2,width=0.4,color="black", fillcolor="white", style="filled",URL="$_sample_application_8h.html"];
  Node6 -> Node7 [dir="back",color="midnightblue",fontsize="10",style="solid",fontname="Helvetica"];
  Node7 [label="/workplace/avs-device\l-sdk/SampleApp/src/main.cpp",height=0.2,width=0.4,color="black", fillcolor="white", style="filled",URL="$main_8cpp.html"];
  Node6 -> Node8 [dir="back",color="midnightblue",fontsize="10",style="solid",fontname="Helvetica"];
  Node8 [label="/workplace/avs-device\l-sdk/SampleApp/src/SampleApplication.cpp",height=0.2,width=0.4,color="black", fillcolor="white", style="filled",URL="$_sample_application_8cpp.html"];
  Node5 -> Node9 [dir="back",color="midnightblue",fontsize="10",style="solid",fontname="Helvetica"];
  Node9 [label="/workplace/avs-device\l-sdk/SampleApp/src/UserInput\lManager.cpp",height=0.2,width=0.4,color="black", fillcolor="white", style="filled",URL="$_user_input_manager_8cpp.html"];
  Node4 -> Node10 [dir="back",color="midnightblue",fontsize="10",style="solid",fontname="Helvetica"];
  Node10 [label="/workplace/avs-device\l-sdk/SampleApp/src/Interaction\lManager.cpp",height=0.2,width=0.4,color="black", fillcolor="white", style="filled",URL="$_interaction_manager_8cpp.html"];
  Node3 -> Node11 [dir="back",color="midnightblue",fontsize="10",style="solid",fontname="Helvetica"];
  Node11 [label="/workplace/avs-device\l-sdk/SampleApp/src/UIManager.cpp",height=0.2,width=0.4,color="black", fillcolor="white", style="filled",URL="$_u_i_manager_8cpp.html"];
}
