digraph "/workplace/avs-device-sdk/Integration/include/Integration/ConnectionStatusObserver.h"
{
  edge [fontname="Helvetica",fontsize="10",labelfontname="Helvetica",labelfontsize="10"];
  node [fontname="Helvetica",fontsize="10",shape=record];
  Node1 [label="/workplace/avs-device\l-sdk/Integration/include\l/Integration/ConnectionStatusObserver.h",height=0.2,width=0.4,color="black", fillcolor="grey75", style="filled", fontcolor="black"];
  Node1 -> Node2 [dir="back",color="midnightblue",fontsize="10",style="solid",fontname="Helvetica"];
  Node2 [label="/workplace/avs-device\l-sdk/Integration/include\l/Integration/ACLTestContext.h",height=0.2,width=0.4,color="black", fillcolor="white", style="filled",URL="$_a_c_l_test_context_8h.html"];
  Node2 -> Node3 [dir="back",color="midnightblue",fontsize="10",style="solid",fontname="Helvetica"];
  Node3 [label="/workplace/avs-device\l-sdk/Integration/src\l/ACLTestContext.cpp",height=0.2,width=0.4,color="black", fillcolor="white", style="filled",URL="$_a_c_l_test_context_8cpp.html"];
  Node2 -> Node4 [dir="back",color="midnightblue",fontsize="10",style="solid",fontname="Helvetica"];
  Node4 [label="/workplace/avs-device\l-sdk/Integration/test\l/AlertsIntegrationTest.cpp",height=0.2,width=0.4,color="black", fillcolor="white", style="filled",URL="$_alerts_integration_test_8cpp.html"];
  Node2 -> Node5 [dir="back",color="midnightblue",fontsize="10",style="solid",fontname="Helvetica"];
  Node5 [label="/workplace/avs-device\l-sdk/Integration/test\l/AlexaCommunicationsLibraryTest.cpp",height=0.2,width=0.4,color="black", fillcolor="white", style="filled",URL="$_alexa_communications_library_test_8cpp.html"];
  Node2 -> Node6 [dir="back",color="midnightblue",fontsize="10",style="solid",fontname="Helvetica"];
  Node6 [label="/workplace/avs-device\l-sdk/Integration/test\l/AlexaDirectiveSequencerLibrary\lTest.cpp",height=0.2,width=0.4,color="black", fillcolor="white", style="filled",URL="$_alexa_directive_sequencer_library_test_8cpp.html"];
  Node2 -> Node7 [dir="back",color="midnightblue",fontsize="10",style="solid",fontname="Helvetica"];
  Node7 [label="/workplace/avs-device\l-sdk/Integration/test\l/AudioInputProcessorIntegration\lTest.cpp",height=0.2,width=0.4,color="black", fillcolor="white", style="filled",URL="$_audio_input_processor_integration_test_8cpp.html"];
  Node2 -> Node8 [dir="back",color="midnightblue",fontsize="10",style="solid",fontname="Helvetica"];
  Node8 [label="/workplace/avs-device\l-sdk/Integration/test\l/AudioPlayerIntegrationTest.cpp",height=0.2,width=0.4,color="black", fillcolor="white", style="filled",URL="$_audio_player_integration_test_8cpp.html"];
  Node2 -> Node9 [dir="back",color="midnightblue",fontsize="10",style="solid",fontname="Helvetica"];
  Node9 [label="/workplace/avs-device\l-sdk/Integration/test\l/NetworkIntegrationTests.cpp",height=0.2,width=0.4,color="black", fillcolor="white", style="filled",URL="$_network_integration_tests_8cpp.html"];
  Node2 -> Node10 [dir="back",color="midnightblue",fontsize="10",style="solid",fontname="Helvetica"];
  Node10 [label="/workplace/avs-device\l-sdk/Integration/test\l/SpeechSynthesizerIntegration\lTest.cpp",height=0.2,width=0.4,color="black", fillcolor="white", style="filled",URL="$_speech_synthesizer_integration_test_8cpp.html"];
  Node1 -> Node11 [dir="back",color="midnightblue",fontsize="10",style="solid",fontname="Helvetica"];
  Node11 [label="/workplace/avs-device\l-sdk/Integration/include\l/Integration/AuthDelegateTestContext.h",height=0.2,width=0.4,color="black", fillcolor="white", style="filled",URL="$_auth_delegate_test_context_8h.html"];
  Node11 -> Node2 [dir="back",color="midnightblue",fontsize="10",style="solid",fontname="Helvetica"];
  Node11 -> Node12 [dir="back",color="midnightblue",fontsize="10",style="solid",fontname="Helvetica"];
  Node12 [label="/workplace/avs-device\l-sdk/Integration/src\l/AuthDelegateTestContext.cpp",height=0.2,width=0.4,color="black", fillcolor="white", style="filled",URL="$_auth_delegate_test_context_8cpp.html"];
  Node11 -> Node13 [dir="back",color="midnightblue",fontsize="10",style="solid",fontname="Helvetica"];
  Node13 [label="/workplace/avs-device\l-sdk/Integration/test\l/AlexaAuthorizationDelegateTest.cpp",height=0.2,width=0.4,color="black", fillcolor="white", style="filled",URL="$_alexa_authorization_delegate_test_8cpp.html"];
  Node11 -> Node14 [dir="back",color="midnightblue",fontsize="10",style="solid",fontname="Helvetica"];
  Node14 [label="/workplace/avs-device\l-sdk/Integration/test\l/ServerDisconnectIntegration\lTest.cpp",height=0.2,width=0.4,color="black", fillcolor="white", style="filled",URL="$_server_disconnect_integration_test_8cpp.html"];
  Node1 -> Node15 [dir="back",color="midnightblue",fontsize="10",style="solid",fontname="Helvetica"];
  Node15 [label="/workplace/avs-device\l-sdk/Integration/src\l/ConnectionStatusObserver.cpp",height=0.2,width=0.4,color="black", fillcolor="white", style="filled",URL="$_connection_status_observer_8cpp.html"];
  Node1 -> Node5 [dir="back",color="midnightblue",fontsize="10",style="solid",fontname="Helvetica"];
  Node1 -> Node9 [dir="back",color="midnightblue",fontsize="10",style="solid",fontname="Helvetica"];
  Node1 -> Node14 [dir="back",color="midnightblue",fontsize="10",style="solid",fontname="Helvetica"];
  Node1 -> Node10 [dir="back",color="midnightblue",fontsize="10",style="solid",fontname="Helvetica"];
}
