digraph "/workplace/avs-device-sdk/ApplicationUtilities/Resources/Audio/include/Audio/Data/system_comm_call_disconnected_.mp3.h"
{
  edge [fontname="Helvetica",fontsize="10",labelfontname="Helvetica",labelfontsize="10"];
  node [fontname="Helvetica",fontsize="10",shape=record];
  Node1 [label="/workplace/avs-device\l-sdk/ApplicationUtilities\l/Resources/Audio/include\l/Audio/Data/system_comm_call\l_disconnected_.mp3.h",height=0.2,width=0.4,color="black", fillcolor="grey75", style="filled", fontcolor="black"];
  Node1 -> Node2 [dir="back",color="midnightblue",fontsize="10",style="solid",fontname="Helvetica"];
  Node2 [label="/workplace/avs-device\l-sdk/ApplicationUtilities\l/Resources/Audio/src/Communications\lAudioFactory.cpp",height=0.2,width=0.4,color="black", fillcolor="white", style="filled",URL="$_communications_audio_factory_8cpp.html"];
}
