digraph "/workplace/avs-device-sdk/CapabilityAgents/Alerts/src/Storage/SQLiteAlertStorage.cpp"
{
  edge [fontname="Helvetica",fontsize="10",labelfontname="Helvetica",labelfontsize="10"];
  node [fontname="Helvetica",fontsize="10",shape=record];
  Node1 [label="/workplace/avs-device\l-sdk/CapabilityAgents\l/Alerts/src/Storage/SQLiteAlert\lStorage.cpp",height=0.2,width=0.4,color="black", fillcolor="grey75", style="filled", fontcolor="black"];
  Node1 -> Node2 [color="midnightblue",fontsize="10",style="solid",fontname="Helvetica"];
  Node2 [label="Alerts/Storage/SQLiteAlert\lStorage.h",height=0.2,width=0.4,color="black", fillcolor="white", style="filled",URL="$_s_q_lite_alert_storage_8h.html"];
  Node2 -> Node3 [color="midnightblue",fontsize="10",style="solid",fontname="Helvetica"];
  Node3 [label="Alerts/Storage/AlertStorage\lInterface.h",height=0.2,width=0.4,color="black", fillcolor="white", style="filled",URL="$_alert_storage_interface_8h.html"];
  Node3 -> Node4 [color="midnightblue",fontsize="10",style="solid",fontname="Helvetica"];
  Node4 [label="Alerts/Alert.h",height=0.2,width=0.4,color="black", fillcolor="white", style="filled",URL="$_alert_8h.html"];
  Node4 -> Node5 [color="midnightblue",fontsize="10",style="solid",fontname="Helvetica"];
  Node5 [label="Alerts/AlertObserverInterface.h",height=0.2,width=0.4,color="black", fillcolor="white", style="filled",URL="$_alert_observer_interface_8h.html"];
  Node5 -> Node6 [color="midnightblue",fontsize="10",style="solid",fontname="Helvetica"];
  Node6 [label="string",height=0.2,width=0.4,color="grey75", fillcolor="white", style="filled"];
  Node4 -> Node7 [color="midnightblue",fontsize="10",style="solid",fontname="Helvetica"];
  Node7 [label="Alerts/Renderer/Renderer.h",height=0.2,width=0.4,color="black", fillcolor="white", style="filled",URL="$_renderer_8h.html"];
  Node7 -> Node8 [color="midnightblue",fontsize="10",style="solid",fontname="Helvetica"];
  Node8 [label="Alerts/Renderer/Renderer\lInterface.h",height=0.2,width=0.4,color="black", fillcolor="white", style="filled",URL="$_renderer_interface_8h.html"];
  Node8 -> Node9 [color="midnightblue",fontsize="10",style="solid",fontname="Helvetica"];
  Node9 [label="Alerts/Renderer/Renderer\lObserverInterface.h",height=0.2,width=0.4,color="black", fillcolor="white", style="filled",URL="$_renderer_observer_interface_8h.html"];
  Node9 -> Node6 [color="midnightblue",fontsize="10",style="solid",fontname="Helvetica"];
  Node8 -> Node10 [color="midnightblue",fontsize="10",style="solid",fontname="Helvetica"];
  Node10 [label="chrono",height=0.2,width=0.4,color="grey75", fillcolor="white", style="filled"];
  Node8 -> Node11 [color="midnightblue",fontsize="10",style="solid",fontname="Helvetica"];
  Node11 [label="functional",height=0.2,width=0.4,color="grey75", fillcolor="white", style="filled"];
  Node8 -> Node12 [color="midnightblue",fontsize="10",style="solid",fontname="Helvetica"];
  Node12 [label="memory",height=0.2,width=0.4,color="grey75", fillcolor="white", style="filled"];
  Node8 -> Node6 [color="midnightblue",fontsize="10",style="solid",fontname="Helvetica"];
  Node8 -> Node13 [color="midnightblue",fontsize="10",style="solid",fontname="Helvetica"];
  Node13 [label="vector",height=0.2,width=0.4,color="grey75", fillcolor="white", style="filled"];
  Node7 -> Node9 [color="midnightblue",fontsize="10",style="solid",fontname="Helvetica"];
  Node7 -> Node14 [color="midnightblue",fontsize="10",style="solid",fontname="Helvetica"];
  Node14 [label="AVSCommon/Utils/Threading\l/Executor.h",height=0.2,width=0.4,color="red", fillcolor="white", style="filled",URL="$_executor_8h.html"];
  Node14 -> Node15 [color="midnightblue",fontsize="10",style="solid",fontname="Helvetica"];
  Node15 [label="atomic",height=0.2,width=0.4,color="grey75", fillcolor="white", style="filled"];
  Node14 -> Node16 [color="midnightblue",fontsize="10",style="solid",fontname="Helvetica"];
  Node16 [label="condition_variable",height=0.2,width=0.4,color="grey75", fillcolor="white", style="filled"];
  Node14 -> Node10 [color="midnightblue",fontsize="10",style="solid",fontname="Helvetica"];
  Node14 -> Node11 [color="midnightblue",fontsize="10",style="solid",fontname="Helvetica"];
  Node14 -> Node17 [color="midnightblue",fontsize="10",style="solid",fontname="Helvetica"];
  Node17 [label="future",height=0.2,width=0.4,color="grey75", fillcolor="white", style="filled"];
  Node14 -> Node12 [color="midnightblue",fontsize="10",style="solid",fontname="Helvetica"];
  Node14 -> Node18 [color="midnightblue",fontsize="10",style="solid",fontname="Helvetica"];
  Node18 [label="mutex",height=0.2,width=0.4,color="grey75", fillcolor="white", style="filled"];
  Node7 -> Node19 [color="midnightblue",fontsize="10",style="solid",fontname="Helvetica"];
  Node19 [label="AVSCommon/Utils/MediaPlayer\l/MediaPlayerInterface.h",height=0.2,width=0.4,color="red", fillcolor="white", style="filled",URL="$_media_player_interface_8h.html"];
  Node19 -> Node10 [color="midnightblue",fontsize="10",style="solid",fontname="Helvetica"];
  Node19 -> Node17 [color="midnightblue",fontsize="10",style="solid",fontname="Helvetica"];
  Node19 -> Node12 [color="midnightblue",fontsize="10",style="solid",fontname="Helvetica"];
  Node7 -> Node20 [color="midnightblue",fontsize="10",style="solid",fontname="Helvetica"];
  Node20 [label="AVSCommon/Utils/MediaPlayer\l/MediaPlayerObserverInterface.h",height=0.2,width=0.4,color="red", fillcolor="white", style="filled",URL="$_media_player_observer_interface_8h.html"];
  Node20 -> Node6 [color="midnightblue",fontsize="10",style="solid",fontname="Helvetica"];
  Node20 -> Node13 [color="midnightblue",fontsize="10",style="solid",fontname="Helvetica"];
  Node20 -> Node12 [color="midnightblue",fontsize="10",style="solid",fontname="Helvetica"];
  Node20 -> Node19 [color="midnightblue",fontsize="10",style="solid",fontname="Helvetica"];
  Node7 -> Node16 [color="midnightblue",fontsize="10",style="solid",fontname="Helvetica"];
  Node7 -> Node18 [color="midnightblue",fontsize="10",style="solid",fontname="Helvetica"];
  Node7 -> Node6 [color="midnightblue",fontsize="10",style="solid",fontname="Helvetica"];
  Node7 -> Node13 [color="midnightblue",fontsize="10",style="solid",fontname="Helvetica"];
  Node4 -> Node9 [color="midnightblue",fontsize="10",style="solid",fontname="Helvetica"];
  Node4 -> Node21 [color="midnightblue",fontsize="10",style="solid",fontname="Helvetica"];
  Node21 [label="AVSCommon/AVS/FocusState.h",height=0.2,width=0.4,color="black", fillcolor="white", style="filled",URL="$_focus_state_8h.html"];
  Node21 -> Node6 [color="midnightblue",fontsize="10",style="solid",fontname="Helvetica"];
  Node4 -> Node22 [color="midnightblue",fontsize="10",style="solid",fontname="Helvetica"];
  Node22 [label="AVSCommon/Utils/Timing\l/Timer.h",height=0.2,width=0.4,color="red", fillcolor="white", style="filled",URL="$_a_v_s_common_2_utils_2include_2_a_v_s_common_2_utils_2_timing_2_timer_8h.html"];
  Node22 -> Node10 [color="midnightblue",fontsize="10",style="solid",fontname="Helvetica"];
  Node22 -> Node16 [color="midnightblue",fontsize="10",style="solid",fontname="Helvetica"];
  Node22 -> Node11 [color="midnightblue",fontsize="10",style="solid",fontname="Helvetica"];
  Node22 -> Node17 [color="midnightblue",fontsize="10",style="solid",fontname="Helvetica"];
  Node22 -> Node18 [color="midnightblue",fontsize="10",style="solid",fontname="Helvetica"];
  Node22 -> Node23 [color="midnightblue",fontsize="10",style="solid",fontname="Helvetica"];
  Node23 [label="thread",height=0.2,width=0.4,color="grey75", fillcolor="white", style="filled"];
  Node4 -> Node24 [color="midnightblue",fontsize="10",style="solid",fontname="Helvetica"];
  Node24 [label="AVSCommon/Utils/Timing\l/TimePoint.h",height=0.2,width=0.4,color="red", fillcolor="white", style="filled",URL="$_time_point_8h.html"];
  Node24 -> Node6 [color="midnightblue",fontsize="10",style="solid",fontname="Helvetica"];
  Node4 -> Node25 [color="midnightblue",fontsize="10",style="solid",fontname="Helvetica"];
  Node25 [label="map",height=0.2,width=0.4,color="grey75", fillcolor="white", style="filled"];
  Node4 -> Node12 [color="midnightblue",fontsize="10",style="solid",fontname="Helvetica"];
  Node4 -> Node18 [color="midnightblue",fontsize="10",style="solid",fontname="Helvetica"];
  Node4 -> Node6 [color="midnightblue",fontsize="10",style="solid",fontname="Helvetica"];
  Node4 -> Node26 [color="midnightblue",fontsize="10",style="solid",fontname="Helvetica"];
  Node26 [label="unordered_map",height=0.2,width=0.4,color="grey75", fillcolor="white", style="filled"];
  Node4 -> Node13 [color="midnightblue",fontsize="10",style="solid",fontname="Helvetica"];
  Node4 -> Node27 [color="midnightblue",fontsize="10",style="solid",fontname="Helvetica"];
  Node27 [label="rapidjson/document.h",height=0.2,width=0.4,color="grey75", fillcolor="white", style="filled"];
  Node3 -> Node28 [color="midnightblue",fontsize="10",style="solid",fontname="Helvetica"];
  Node28 [label="list",height=0.2,width=0.4,color="grey75", fillcolor="white", style="filled"];
  Node3 -> Node12 [color="midnightblue",fontsize="10",style="solid",fontname="Helvetica"];
  Node3 -> Node6 [color="midnightblue",fontsize="10",style="solid",fontname="Helvetica"];
  Node3 -> Node13 [color="midnightblue",fontsize="10",style="solid",fontname="Helvetica"];
  Node2 -> Node29 [color="midnightblue",fontsize="10",style="solid",fontname="Helvetica"];
  Node29 [label="set",height=0.2,width=0.4,color="grey75", fillcolor="white", style="filled"];
  Node2 -> Node30 [color="midnightblue",fontsize="10",style="solid",fontname="Helvetica"];
  Node30 [label="AVSCommon/SDKInterfaces\l/Audio/AlertsAudioFactoryInterface.h",height=0.2,width=0.4,color="black", fillcolor="white", style="filled",URL="$_alerts_audio_factory_interface_8h.html"];
  Node30 -> Node11 [color="midnightblue",fontsize="10",style="solid",fontname="Helvetica"];
  Node30 -> Node31 [color="midnightblue",fontsize="10",style="solid",fontname="Helvetica"];
  Node31 [label="istream",height=0.2,width=0.4,color="grey75", fillcolor="white", style="filled"];
  Node30 -> Node12 [color="midnightblue",fontsize="10",style="solid",fontname="Helvetica"];
  Node2 -> Node32 [color="midnightblue",fontsize="10",style="solid",fontname="Helvetica"];
  Node32 [label="AVSCommon/Utils/Configuration\l/ConfigurationNode.h",height=0.2,width=0.4,color="black", fillcolor="white", style="filled",URL="$_configuration_node_8h.html"];
  Node32 -> Node10 [color="midnightblue",fontsize="10",style="solid",fontname="Helvetica"];
  Node32 -> Node33 [color="midnightblue",fontsize="10",style="solid",fontname="Helvetica"];
  Node33 [label="iostream",height=0.2,width=0.4,color="grey75", fillcolor="white", style="filled"];
  Node32 -> Node12 [color="midnightblue",fontsize="10",style="solid",fontname="Helvetica"];
  Node32 -> Node18 [color="midnightblue",fontsize="10",style="solid",fontname="Helvetica"];
  Node32 -> Node6 [color="midnightblue",fontsize="10",style="solid",fontname="Helvetica"];
  Node32 -> Node13 [color="midnightblue",fontsize="10",style="solid",fontname="Helvetica"];
  Node32 -> Node27 [color="midnightblue",fontsize="10",style="solid",fontname="Helvetica"];
  Node2 -> Node34 [color="midnightblue",fontsize="10",style="solid",fontname="Helvetica"];
  Node34 [label="SQLiteStorage/SQLiteDatabase.h",height=0.2,width=0.4,color="black", fillcolor="white", style="filled",URL="$_s_q_lite_database_8h.html"];
  Node34 -> Node12 [color="midnightblue",fontsize="10",style="solid",fontname="Helvetica"];
  Node34 -> Node6 [color="midnightblue",fontsize="10",style="solid",fontname="Helvetica"];
  Node34 -> Node13 [color="midnightblue",fontsize="10",style="solid",fontname="Helvetica"];
  Node34 -> Node35 [color="midnightblue",fontsize="10",style="solid",fontname="Helvetica"];
  Node35 [label="sqlite3.h",height=0.2,width=0.4,color="grey75", fillcolor="white", style="filled"];
  Node34 -> Node36 [color="midnightblue",fontsize="10",style="solid",fontname="Helvetica"];
  Node36 [label="SQLiteStorage/SQLiteStatement.h",height=0.2,width=0.4,color="black", fillcolor="white", style="filled",URL="$_s_q_lite_statement_8h.html"];
  Node36 -> Node35 [color="midnightblue",fontsize="10",style="solid",fontname="Helvetica"];
  Node36 -> Node6 [color="midnightblue",fontsize="10",style="solid",fontname="Helvetica"];
  Node1 -> Node37 [color="midnightblue",fontsize="10",style="solid",fontname="Helvetica"];
  Node37 [label="Alerts/Alarm.h",height=0.2,width=0.4,color="black", fillcolor="white", style="filled",URL="$_alarm_8h.html"];
  Node37 -> Node4 [color="midnightblue",fontsize="10",style="solid",fontname="Helvetica"];
  Node1 -> Node38 [color="midnightblue",fontsize="10",style="solid",fontname="Helvetica"];
  Node38 [label="Alerts/Reminder.h",height=0.2,width=0.4,color="black", fillcolor="white", style="filled",URL="$_reminder_8h.html"];
  Node38 -> Node4 [color="midnightblue",fontsize="10",style="solid",fontname="Helvetica"];
  Node1 -> Node39 [color="midnightblue",fontsize="10",style="solid",fontname="Helvetica"];
  Node39 [label="Alerts/Timer.h",height=0.2,width=0.4,color="black", fillcolor="white", style="filled",URL="$_capability_agents_2_alerts_2include_2_alerts_2_timer_8h.html"];
  Node39 -> Node4 [color="midnightblue",fontsize="10",style="solid",fontname="Helvetica"];
  Node1 -> Node36 [color="midnightblue",fontsize="10",style="solid",fontname="Helvetica"];
  Node1 -> Node40 [color="midnightblue",fontsize="10",style="solid",fontname="Helvetica"];
  Node40 [label="SQLiteStorage/SQLiteUtils.h",height=0.2,width=0.4,color="black", fillcolor="white", style="filled",URL="$_s_q_lite_utils_8h.html"];
  Node40 -> Node6 [color="midnightblue",fontsize="10",style="solid",fontname="Helvetica"];
  Node40 -> Node35 [color="midnightblue",fontsize="10",style="solid",fontname="Helvetica"];
  Node40 -> Node34 [color="midnightblue",fontsize="10",style="solid",fontname="Helvetica"];
  Node1 -> Node41 [color="midnightblue",fontsize="10",style="solid",fontname="Helvetica"];
  Node41 [label="AVSCommon/Utils/File\l/FileUtils.h",height=0.2,width=0.4,color="black", fillcolor="white", style="filled",URL="$_file_utils_8h.html"];
  Node41 -> Node6 [color="midnightblue",fontsize="10",style="solid",fontname="Helvetica"];
  Node1 -> Node42 [color="midnightblue",fontsize="10",style="solid",fontname="Helvetica"];
  Node42 [label="AVSCommon/Utils/Logger\l/Logger.h",height=0.2,width=0.4,color="black", fillcolor="white", style="filled",URL="$_logger_8h.html"];
  Node42 -> Node15 [color="midnightblue",fontsize="10",style="solid",fontname="Helvetica"];
  Node42 -> Node10 [color="midnightblue",fontsize="10",style="solid",fontname="Helvetica"];
  Node42 -> Node18 [color="midnightblue",fontsize="10",style="solid",fontname="Helvetica"];
  Node42 -> Node43 [color="midnightblue",fontsize="10",style="solid",fontname="Helvetica"];
  Node43 [label="sstream",height=0.2,width=0.4,color="grey75", fillcolor="white", style="filled"];
  Node42 -> Node13 [color="midnightblue",fontsize="10",style="solid",fontname="Helvetica"];
  Node42 -> Node32 [color="midnightblue",fontsize="10",style="solid",fontname="Helvetica"];
  Node42 -> Node44 [color="midnightblue",fontsize="10",style="solid",fontname="Helvetica"];
  Node44 [label="AVSCommon/Utils/Logger\l/Level.h",height=0.2,width=0.4,color="black", fillcolor="white", style="filled",URL="$_level_8h.html"];
  Node44 -> Node6 [color="midnightblue",fontsize="10",style="solid",fontname="Helvetica"];
  Node42 -> Node45 [color="midnightblue",fontsize="10",style="solid",fontname="Helvetica"];
  Node45 [label="AVSCommon/Utils/Logger\l/LogEntry.h",height=0.2,width=0.4,color="black", fillcolor="white", style="filled",URL="$_log_entry_8h.html"];
  Node45 -> Node43 [color="midnightblue",fontsize="10",style="solid",fontname="Helvetica"];
  Node45 -> Node6 [color="midnightblue",fontsize="10",style="solid",fontname="Helvetica"];
  Node45 -> Node46 [color="midnightblue",fontsize="10",style="solid",fontname="Helvetica"];
  Node46 [label="AVSCommon/Utils/Logger\l/LogEntryStream.h",height=0.2,width=0.4,color="red", fillcolor="white", style="filled",URL="$_log_entry_stream_8h.html"];
  Node42 -> Node47 [color="midnightblue",fontsize="10",style="solid",fontname="Helvetica"];
  Node47 [label="AVSCommon/Utils/Logger\l/LogLevelObserverInterface.h",height=0.2,width=0.4,color="black", fillcolor="white", style="filled",URL="$_log_level_observer_interface_8h.html"];
  Node47 -> Node44 [color="midnightblue",fontsize="10",style="solid",fontname="Helvetica"];
  Node42 -> Node48 [color="midnightblue",fontsize="10",style="solid",fontname="Helvetica"];
  Node48 [label="AVSCommon/Utils/Logger\l/SinkObserverInterface.h",height=0.2,width=0.4,color="black", fillcolor="white", style="filled",URL="$_sink_observer_interface_8h.html"];
  Node48 -> Node12 [color="midnightblue",fontsize="10",style="solid",fontname="Helvetica"];
  Node1 -> Node49 [color="midnightblue",fontsize="10",style="solid",fontname="Helvetica"];
  Node49 [label="AVSCommon/Utils/String\l/StringUtils.h",height=0.2,width=0.4,color="black", fillcolor="white", style="filled",URL="$_string_utils_8h.html"];
  Node49 -> Node6 [color="midnightblue",fontsize="10",style="solid",fontname="Helvetica"];
  Node49 -> Node13 [color="midnightblue",fontsize="10",style="solid",fontname="Helvetica"];
  Node1 -> Node50 [color="midnightblue",fontsize="10",style="solid",fontname="Helvetica"];
  Node50 [label="fstream",height=0.2,width=0.4,color="grey75", fillcolor="white", style="filled"];
  Node1 -> Node29 [color="midnightblue",fontsize="10",style="solid",fontname="Helvetica"];
}
