digraph "alexaClientSDK::capabilityAgents::alerts::storage::SQLiteAlertStorage"
{
  edge [fontname="Helvetica",fontsize="10",labelfontname="Helvetica",labelfontsize="10"];
  node [fontname="Helvetica",fontsize="10",shape=record];
  Node1 [label="alexaClientSDK::capability\lAgents::alerts::storage\l::SQLiteAlertStorage",height=0.2,width=0.4,color="black", fillcolor="grey75", style="filled", fontcolor="black"];
  Node2 -> Node1 [dir="back",color="midnightblue",fontsize="10",style="solid",fontname="Helvetica"];
  Node2 [label="alexaClientSDK::capability\lAgents::alerts::storage\l::AlertStorageInterface",height=0.2,width=0.4,color="black", fillcolor="white", style="filled",URL="$classalexa_client_s_d_k_1_1capability_agents_1_1alerts_1_1storage_1_1_alert_storage_interface.html"];
}
