digraph "/workplace/avs-device-sdk/SpeechEncoder/OpusEncoderContext/src" {
  compound=true
  node [ fontsize="10", fontname="Helvetica"];
  edge [ labelfontsize="10", labelfontname="Helvetica"];
  subgraph clusterdir_9380053b18258191a72e7d4db96903c7 {
    graph [ bgcolor="#ddddee", pencolor="black", label="OpusEncoderContext" fontname="Helvetica", fontsize="10", URL="dir_9380053b18258191a72e7d4db96903c7.html"]
  dir_da2b57edd99c1329aac671cd6139532d [shape=box, label="src", style="filled", fillcolor="#eeeeff", pencolor="black", URL="dir_da2b57edd99c1329aac671cd6139532d.html"];
  }
  dir_40361ce46d5301bb7fc9012f63c9bd0e [shape=box label="include" fillcolor="white" style="filled" color="red" URL="dir_40361ce46d5301bb7fc9012f63c9bd0e.html"];
  dir_13e65effb2bde530b17b3d5eefcd0266 [shape=box label="AVSCommon" fillcolor="white" style="filled" color="red" URL="dir_13e65effb2bde530b17b3d5eefcd0266.html"];
  dir_da2b57edd99c1329aac671cd6139532d->dir_40361ce46d5301bb7fc9012f63c9bd0e [headlabel="1", labeldistance=1.5 headhref="dir_000299_000297.html"];
  dir_da2b57edd99c1329aac671cd6139532d->dir_13e65effb2bde530b17b3d5eefcd0266 [headlabel="2", labeldistance=1.5 headhref="dir_000299_000015.html"];
}
