digraph "/workplace/avs-device-sdk/CertifiedSender/test/MockCertifiedSender.h"
{
  edge [fontname="Helvetica",fontsize="10",labelfontname="Helvetica",labelfontsize="10"];
  node [fontname="Helvetica",fontsize="10",shape=record];
  Node1 [label="/workplace/avs-device\l-sdk/CertifiedSender\l/test/MockCertifiedSender.h",height=0.2,width=0.4,color="black", fillcolor="grey75", style="filled", fontcolor="black"];
  Node1 -> Node2 [dir="back",color="midnightblue",fontsize="10",style="solid",fontname="Helvetica"];
  Node2 [label="/workplace/avs-device\l-sdk/CertifiedSender\l/test/Common/MockCertifiedSender.cpp",height=0.2,width=0.4,color="black", fillcolor="white", style="filled",URL="$_mock_certified_sender_8cpp.html"];
}
