digraph "/workplace/avs-device-sdk/AVSCommon/SDKInterfaces/include/AVSCommon/SDKInterfaces/ChannelObserverInterface.h"
{
  edge [fontname="Helvetica",fontsize="10",labelfontname="Helvetica",labelfontsize="10"];
  node [fontname="Helvetica",fontsize="10",shape=record];
  Node1 [label="/workplace/avs-device\l-sdk/AVSCommon/SDKInterfaces\l/include/AVSCommon/SDKInterfaces\l/ChannelObserverInterface.h",height=0.2,width=0.4,color="black", fillcolor="grey75", style="filled", fontcolor="black"];
  Node1 -> Node2 [color="midnightblue",fontsize="10",style="solid",fontname="Helvetica"];
  Node2 [label="AVSCommon/AVS/FocusState.h",height=0.2,width=0.4,color="black", fillcolor="white", style="filled",URL="$_focus_state_8h.html"];
  Node2 -> Node3 [color="midnightblue",fontsize="10",style="solid",fontname="Helvetica"];
  Node3 [label="string",height=0.2,width=0.4,color="grey75", fillcolor="white", style="filled"];
}
