digraph "/workplace/avs-device-sdk/CapabilityAgents/System/a4btest" {
  compound=true
  node [ fontsize="10", fontname="Helvetica"];
  edge [ labelfontsize="10", labelfontname="Helvetica"];
  subgraph clusterdir_5c34f9d308a00f77f2da80e40fcb7b22 {
    graph [ bgcolor="#ddddee", pencolor="black", label="System" fontname="Helvetica", fontsize="10", URL="dir_5c34f9d308a00f77f2da80e40fcb7b22.html"]
  dir_950802969311e8f74f93638f70ac79ea [shape=box, label="a4btest", style="filled", fillcolor="#eeeeff", pencolor="black", URL="dir_950802969311e8f74f93638f70ac79ea.html"];
  }
  dir_76128cd39a5afd90f6d9deea527eb79c [shape=box label="include" fillcolor="white" style="filled" color="red" URL="dir_76128cd39a5afd90f6d9deea527eb79c.html"];
  dir_13e65effb2bde530b17b3d5eefcd0266 [shape=box label="AVSCommon" fillcolor="white" style="filled" color="red" URL="dir_13e65effb2bde530b17b3d5eefcd0266.html"];
  dir_edb1b7e8f1a5d5a1b864206edd6d398d [shape=box label="ADSL" fillcolor="white" style="filled" color="red" URL="dir_edb1b7e8f1a5d5a1b864206edd6d398d.html"];
  dir_76128cd39a5afd90f6d9deea527eb79c->dir_13e65effb2bde530b17b3d5eefcd0266 [headlabel="24", labeldistance=1.5 headhref="dir_000201_000015.html"];
  dir_950802969311e8f74f93638f70ac79ea->dir_76128cd39a5afd90f6d9deea527eb79c [headlabel="1", labeldistance=1.5 headhref="dir_000200_000201.html"];
  dir_950802969311e8f74f93638f70ac79ea->dir_13e65effb2bde530b17b3d5eefcd0266 [headlabel="4", labeldistance=1.5 headhref="dir_000200_000015.html"];
  dir_950802969311e8f74f93638f70ac79ea->dir_edb1b7e8f1a5d5a1b864206edd6d398d [headlabel="1", labeldistance=1.5 headhref="dir_000200_000009.html"];
  dir_edb1b7e8f1a5d5a1b864206edd6d398d->dir_13e65effb2bde530b17b3d5eefcd0266 [headlabel="32", labeldistance=1.5 headhref="dir_000009_000015.html"];
}
