digraph "/workplace/avs-device-sdk/MediaPlayer/GStreamerMediaPlayer/test" {
  compound=true
  node [ fontsize="10", fontname="Helvetica"];
  edge [ labelfontsize="10", labelfontname="Helvetica"];
  subgraph clusterdir_e1f7d5df1447213cfb529aad5fa2c859 {
    graph [ bgcolor="#ddddee", pencolor="black", label="GStreamerMediaPlayer" fontname="Helvetica", fontsize="10", URL="dir_e1f7d5df1447213cfb529aad5fa2c859.html"]
  dir_c8b7016d00f27fb841ebdfed199c4e61 [shape=box, label="test", style="filled", fillcolor="#eeeeff", pencolor="black", URL="dir_c8b7016d00f27fb841ebdfed199c4e61.html"];
  }
  dir_655fbec917b1f23289d3ed8ec9803bf1 [shape=box label="PlaylistParser" fillcolor="white" style="filled" color="red" URL="dir_655fbec917b1f23289d3ed8ec9803bf1.html"];
  dir_d1a5c25c65a86ab490915a47e76c835a [shape=box label="include" fillcolor="white" style="filled" color="red" URL="dir_d1a5c25c65a86ab490915a47e76c835a.html"];
  dir_13e65effb2bde530b17b3d5eefcd0266 [shape=box label="AVSCommon" fillcolor="white" style="filled" color="red" URL="dir_13e65effb2bde530b17b3d5eefcd0266.html"];
  dir_655fbec917b1f23289d3ed8ec9803bf1->dir_13e65effb2bde530b17b3d5eefcd0266 [headlabel="36", labeldistance=1.5 headhref="dir_000265_000015.html"];
  dir_d1a5c25c65a86ab490915a47e76c835a->dir_655fbec917b1f23289d3ed8ec9803bf1 [headlabel="1", labeldistance=1.5 headhref="dir_000261_000265.html"];
  dir_d1a5c25c65a86ab490915a47e76c835a->dir_13e65effb2bde530b17b3d5eefcd0266 [headlabel="11", labeldistance=1.5 headhref="dir_000261_000015.html"];
  dir_c8b7016d00f27fb841ebdfed199c4e61->dir_655fbec917b1f23289d3ed8ec9803bf1 [headlabel="1", labeldistance=1.5 headhref="dir_000264_000265.html"];
  dir_c8b7016d00f27fb841ebdfed199c4e61->dir_d1a5c25c65a86ab490915a47e76c835a [headlabel="3", labeldistance=1.5 headhref="dir_000264_000261.html"];
  dir_c8b7016d00f27fb841ebdfed199c4e61->dir_13e65effb2bde530b17b3d5eefcd0266 [headlabel="6", labeldistance=1.5 headhref="dir_000264_000015.html"];
}
