digraph "alexaClientSDK::avsCommon::sdkInterfaces::bluetooth::services::AVRCPTargetInterface"
{
  edge [fontname="Helvetica",fontsize="10",labelfontname="Helvetica",labelfontsize="10"];
  node [fontname="Helvetica",fontsize="10",shape=record];
  rankdir="LR";
  Node1 [label="alexaClientSDK::avsCommon\l::sdkInterfaces::bluetooth\l::services::AVRCPTargetInterface",height=0.2,width=0.4,color="black", fillcolor="grey75", style="filled", fontcolor="black"];
  Node2 -> Node1 [dir="back",color="midnightblue",fontsize="10",style="solid",fontname="Helvetica"];
  Node2 [label="alexaClientSDK::avsCommon\l::sdkInterfaces::bluetooth\l::services::BluetoothServiceInterface",height=0.2,width=0.4,color="black", fillcolor="white", style="filled",URL="$classalexa_client_s_d_k_1_1avs_common_1_1sdk_interfaces_1_1bluetooth_1_1services_1_1_bluetooth_service_interface.html",tooltip="Interface representing a BluetoothService. "];
  Node1 -> Node3 [dir="back",color="midnightblue",fontsize="10",style="solid",fontname="Helvetica"];
  Node3 [label="alexaClientSDK::bluetooth\lImplementations::blueZ\l::BlueZAVRCPTarget",height=0.2,width=0.4,color="black", fillcolor="white", style="filled",URL="$classalexa_client_s_d_k_1_1bluetooth_implementations_1_1blue_z_1_1_blue_z_a_v_r_c_p_target.html",tooltip="A BlueZ implementation of the AVRCPTargetInterface. "];
}
