digraph "Graphical Class Hierarchy"
{
  edge [fontname="Helvetica",fontsize="10",labelfontname="Helvetica",labelfontsize="10"];
  node [fontname="Helvetica",fontsize="10",shape=record];
  rankdir="LR";
  Node1 [label="Test",height=0.2,width=0.4,color="grey75", fillcolor="white", style="filled"];
  Node1 -> Node2 [dir="back",color="midnightblue",fontsize="10",style="solid",fontname="Helvetica"];
  Node2 [label="alexaClientSDK::acl\l::transport::test::HTTP2TransportTest",height=0.2,width=0.4,color="black", fillcolor="white", style="filled",URL="$classalexa_client_s_d_k_1_1acl_1_1transport_1_1test_1_1_h_t_t_p2_transport_test.html",tooltip="Test harness for HTTP2Transport class. "];
  Node1 -> Node3 [dir="back",color="midnightblue",fontsize="10",style="solid",fontname="Helvetica"];
  Node3 [label="alexaClientSDK::application\lUtilities::androidUtilities\l::test::AndroidSLESBufferQueueTest",height=0.2,width=0.4,color="black", fillcolor="white", style="filled",URL="$classalexa_client_s_d_k_1_1application_utilities_1_1android_utilities_1_1test_1_1_android_s_l_e_s_buffer_queue_test.html"];
  Node1 -> Node4 [dir="back",color="midnightblue",fontsize="10",style="solid",fontname="Helvetica"];
  Node4 [label="alexaClientSDK::application\lUtilities::androidUtilities\l::test::AndroidSLESMicrophoneTest",height=0.2,width=0.4,color="black", fillcolor="white", style="filled",URL="$classalexa_client_s_d_k_1_1application_utilities_1_1android_utilities_1_1test_1_1_android_s_l_e_s_microphone_test.html"];
  Node1 -> Node5 [dir="back",color="midnightblue",fontsize="10",style="solid",fontname="Helvetica"];
  Node5 [label="alexaClientSDK::application\lUtilities::androidUtilities\l::test::AndroidSLESObjectTest",height=0.2,width=0.4,color="black", fillcolor="white", style="filled",URL="$classalexa_client_s_d_k_1_1application_utilities_1_1android_utilities_1_1test_1_1_android_s_l_e_s_object_test.html"];
  Node1 -> Node6 [dir="back",color="midnightblue",fontsize="10",style="solid",fontname="Helvetica"];
  Node6 [label="alexaClientSDK::avsCommon\l::utils::json::test::JsonGeneratorTest",height=0.2,width=0.4,color="black", fillcolor="white", style="filled",URL="$classalexa_client_s_d_k_1_1avs_common_1_1utils_1_1json_1_1test_1_1_json_generator_test.html"];
  Node1 -> Node7 [dir="back",color="midnightblue",fontsize="10",style="solid",fontname="Helvetica"];
  Node7 [label="alexaClientSDK::capability\lAgents::interactionModel\l::test::InteractionModelCapability\lAgentTest",height=0.2,width=0.4,color="black", fillcolor="white", style="filled",URL="$classalexa_client_s_d_k_1_1capability_agents_1_1interaction_model_1_1test_1_1_interaction_model_capability_agent_test.html",tooltip="Test harness for InteractionModelCapabilityAgent class. "];
  Node1 -> Node8 [dir="back",color="midnightblue",fontsize="10",style="solid",fontname="Helvetica"];
  Node8 [label="alexaClientSDK::mediaPlayer\l::android::test::AndroidSLESMedia\lPlayerTest",height=0.2,width=0.4,color="black", fillcolor="white", style="filled",URL="$classalexa_client_s_d_k_1_1media_player_1_1android_1_1test_1_1_android_s_l_e_s_media_player_test.html"];
  Node1 -> Node9 [dir="back",color="midnightblue",fontsize="10",style="solid",fontname="Helvetica"];
  Node9 [label="alexaClientSDK::mediaPlayer\l::android::test::AndroidSLESMedia\lQueueTest",height=0.2,width=0.4,color="black", fillcolor="white", style="filled",URL="$classalexa_client_s_d_k_1_1media_player_1_1android_1_1test_1_1_android_s_l_e_s_media_queue_test.html"];
  Node1 -> Node10 [dir="back",color="midnightblue",fontsize="10",style="solid",fontname="Helvetica"];
  Node10 [label="alexaClientSDK::mediaPlayer\l::android::test::AndroidSLESSpeakerTest",height=0.2,width=0.4,color="black", fillcolor="white", style="filled",URL="$classalexa_client_s_d_k_1_1media_player_1_1android_1_1test_1_1_android_s_l_e_s_speaker_test.html"];
  Node1 -> Node11 [dir="back",color="midnightblue",fontsize="10",style="solid",fontname="Helvetica"];
  Node11 [label="alexaClientSDK::mediaPlayer\l::android::test::FFmpegDecoderTest",height=0.2,width=0.4,color="black", fillcolor="white", style="filled",URL="$classalexa_client_s_d_k_1_1media_player_1_1android_1_1test_1_1_f_fmpeg_decoder_test.html"];
  Node1 -> Node12 [dir="back",color="midnightblue",fontsize="10",style="solid",fontname="Helvetica"];
  Node12 [label="alexaClientSDK::mediaPlayer\l::android::test::FFmpegUrlInput\lControllerTest",height=0.2,width=0.4,color="black", fillcolor="white", style="filled",URL="$classalexa_client_s_d_k_1_1media_player_1_1android_1_1test_1_1_f_fmpeg_url_input_controller_test.html"];
  Node1 -> Node13 [dir="back",color="midnightblue",fontsize="10",style="solid",fontname="Helvetica"];
  Node13 [label="alexaClientSDK::settings\l::test::SettingTest",height=0.2,width=0.4,color="black", fillcolor="white", style="filled",URL="$classalexa_client_s_d_k_1_1settings_1_1test_1_1_setting_test.html"];
}
