digraph "/workplace/avs-device-sdk/MediaPlayer/AndroidSLESMediaPlayer" {
  compound=true
  node [ fontsize="10", fontname="Helvetica"];
  edge [ labelfontsize="10", labelfontname="Helvetica"];
  subgraph clusterdir_9d34932954f3d83257e5e12e3f421a72 {
    graph [ bgcolor="#ddddee", pencolor="black", label="MediaPlayer" fontname="Helvetica", fontsize="10", URL="dir_9d34932954f3d83257e5e12e3f421a72.html"]
  subgraph clusterdir_b97c8a12362aabf73b92afdea21f65db {
    graph [ bgcolor="#eeeeff", pencolor="black", label="" URL="dir_b97c8a12362aabf73b92afdea21f65db.html"];
    dir_b97c8a12362aabf73b92afdea21f65db [shape=plaintext label="AndroidSLESMediaPlayer"];
    dir_7b5c7f5aa6c9c2118e08133913118a4b [shape=box label="include" color="red" fillcolor="white" style="filled" URL="dir_7b5c7f5aa6c9c2118e08133913118a4b.html"];
    dir_6a9b6ece2a2b3e9844f10f06f8c54dc4 [shape=box label="src" color="black" fillcolor="white" style="filled" URL="dir_6a9b6ece2a2b3e9844f10f06f8c54dc4.html"];
    dir_09f8576ebf0d3cd6a2f3f83ce5a8feb1 [shape=box label="test" color="black" fillcolor="white" style="filled" URL="dir_09f8576ebf0d3cd6a2f3f83ce5a8feb1.html"];
  }
  }
  dir_748b5abbb33df61eda67007924a1a0cb [shape=box label="ApplicationUtilities" fillcolor="white" style="filled" color="red" URL="dir_748b5abbb33df61eda67007924a1a0cb.html"];
  dir_63c328d9f040c398ed3a99417a38689e [shape=box label="EqualizerImplementations" fillcolor="white" style="filled" color="red" URL="dir_63c328d9f040c398ed3a99417a38689e.html"];
  dir_655fbec917b1f23289d3ed8ec9803bf1 [shape=box label="PlaylistParser" fillcolor="white" style="filled" color="red" URL="dir_655fbec917b1f23289d3ed8ec9803bf1.html"];
  dir_13e65effb2bde530b17b3d5eefcd0266 [shape=box label="AVSCommon" fillcolor="white" style="filled" color="red" URL="dir_13e65effb2bde530b17b3d5eefcd0266.html"];
  dir_748b5abbb33df61eda67007924a1a0cb->dir_63c328d9f040c398ed3a99417a38689e [headlabel="1", labeldistance=1.5 headhref="dir_000026_000221.html"];
  dir_748b5abbb33df61eda67007924a1a0cb->dir_13e65effb2bde530b17b3d5eefcd0266 [headlabel="49", labeldistance=1.5 headhref="dir_000026_000015.html"];
  dir_63c328d9f040c398ed3a99417a38689e->dir_13e65effb2bde530b17b3d5eefcd0266 [headlabel="34", labeldistance=1.5 headhref="dir_000221_000015.html"];
  dir_655fbec917b1f23289d3ed8ec9803bf1->dir_13e65effb2bde530b17b3d5eefcd0266 [headlabel="36", labeldistance=1.5 headhref="dir_000265_000015.html"];
  dir_7b5c7f5aa6c9c2118e08133913118a4b->dir_748b5abbb33df61eda67007924a1a0cb [headlabel="5", labeldistance=1.5 headhref="dir_000256_000026.html"];
  dir_7b5c7f5aa6c9c2118e08133913118a4b->dir_63c328d9f040c398ed3a99417a38689e [headlabel="1", labeldistance=1.5 headhref="dir_000256_000221.html"];
  dir_7b5c7f5aa6c9c2118e08133913118a4b->dir_655fbec917b1f23289d3ed8ec9803bf1 [headlabel="1", labeldistance=1.5 headhref="dir_000256_000265.html"];
  dir_7b5c7f5aa6c9c2118e08133913118a4b->dir_13e65effb2bde530b17b3d5eefcd0266 [headlabel="12", labeldistance=1.5 headhref="dir_000256_000015.html"];
  dir_6a9b6ece2a2b3e9844f10f06f8c54dc4->dir_63c328d9f040c398ed3a99417a38689e [headlabel="1", labeldistance=1.5 headhref="dir_000258_000221.html"];
  dir_6a9b6ece2a2b3e9844f10f06f8c54dc4->dir_655fbec917b1f23289d3ed8ec9803bf1 [headlabel="1", labeldistance=1.5 headhref="dir_000258_000265.html"];
  dir_6a9b6ece2a2b3e9844f10f06f8c54dc4->dir_7b5c7f5aa6c9c2118e08133913118a4b [headlabel="19", labeldistance=1.5 headhref="dir_000258_000256.html"];
  dir_6a9b6ece2a2b3e9844f10f06f8c54dc4->dir_13e65effb2bde530b17b3d5eefcd0266 [headlabel="18", labeldistance=1.5 headhref="dir_000258_000015.html"];
  dir_09f8576ebf0d3cd6a2f3f83ce5a8feb1->dir_748b5abbb33df61eda67007924a1a0cb [headlabel="10", labeldistance=1.5 headhref="dir_000259_000026.html"];
  dir_09f8576ebf0d3cd6a2f3f83ce5a8feb1->dir_655fbec917b1f23289d3ed8ec9803bf1 [headlabel="2", labeldistance=1.5 headhref="dir_000259_000265.html"];
  dir_09f8576ebf0d3cd6a2f3f83ce5a8feb1->dir_7b5c7f5aa6c9c2118e08133913118a4b [headlabel="9", labeldistance=1.5 headhref="dir_000259_000256.html"];
  dir_09f8576ebf0d3cd6a2f3f83ce5a8feb1->dir_13e65effb2bde530b17b3d5eefcd0266 [headlabel="16", labeldistance=1.5 headhref="dir_000259_000015.html"];
}
