digraph "/workplace/avs-device-sdk/AVSCommon/Utils/include/AVSCommon/Utils/Timing/Stopwatch.h"
{
  edge [fontname="Helvetica",fontsize="10",labelfontname="Helvetica",labelfontsize="10"];
  node [fontname="Helvetica",fontsize="10",shape=record];
  Node1 [label="/workplace/avs-device\l-sdk/AVSCommon/Utils\l/include/AVSCommon/Utils\l/Timing/Stopwatch.h",height=0.2,width=0.4,color="black", fillcolor="grey75", style="filled", fontcolor="black"];
  Node1 -> Node2 [dir="back",color="midnightblue",fontsize="10",style="solid",fontname="Helvetica"];
  Node2 [label="/workplace/avs-device\l-sdk/AVSCommon/Utils\l/src/Stopwatch.cpp",height=0.2,width=0.4,color="black", fillcolor="white", style="filled",URL="$_stopwatch_8cpp.html"];
  Node1 -> Node3 [dir="back",color="midnightblue",fontsize="10",style="solid",fontname="Helvetica"];
  Node3 [label="/workplace/avs-device\l-sdk/AVSCommon/Utils\l/test/AVSCommon/Utils\l/MediaPlayer/MockMediaPlayer.h",height=0.2,width=0.4,color="black", fillcolor="white", style="filled",URL="$_mock_media_player_8h.html"];
  Node3 -> Node4 [dir="back",color="midnightblue",fontsize="10",style="solid",fontname="Helvetica"];
  Node4 [label="/workplace/avs-device\l-sdk/AVSCommon/Utils\l/test/Common/MockMediaPlayer.cpp",height=0.2,width=0.4,color="black", fillcolor="white", style="filled",URL="$_mock_media_player_8cpp.html"];
  Node3 -> Node5 [dir="back",color="midnightblue",fontsize="10",style="solid",fontname="Helvetica"];
  Node5 [label="/workplace/avs-device\l-sdk/CapabilityAgents\l/Alerts/test/Renderer\l/RendererTest.cpp",height=0.2,width=0.4,color="black", fillcolor="white", style="filled",URL="$_renderer_test_8cpp.html"];
  Node3 -> Node6 [dir="back",color="midnightblue",fontsize="10",style="solid",fontname="Helvetica"];
  Node6 [label="/workplace/avs-device\l-sdk/CapabilityAgents\l/AudioPlayer/test/AudioPlayer\lTest.cpp",height=0.2,width=0.4,color="black", fillcolor="white", style="filled",URL="$_audio_player_test_8cpp.html"];
  Node3 -> Node7 [dir="back",color="midnightblue",fontsize="10",style="solid",fontname="Helvetica"];
  Node7 [label="/workplace/avs-device\l-sdk/CapabilityAgents\l/ExternalMediaPlayer/test\l/ExternalMediaPlayerTest.cpp",height=0.2,width=0.4,color="black", fillcolor="white", style="filled",URL="$_external_media_player_test_8cpp.html"];
  Node3 -> Node8 [dir="back",color="midnightblue",fontsize="10",style="solid",fontname="Helvetica"];
  Node8 [label="/workplace/avs-device\l-sdk/CapabilityAgents\l/Notifications/test/Notification\lRendererTest.cpp",height=0.2,width=0.4,color="black", fillcolor="white", style="filled",URL="$_notification_renderer_test_8cpp.html"];
  Node3 -> Node9 [dir="back",color="midnightblue",fontsize="10",style="solid",fontname="Helvetica"];
  Node9 [label="/workplace/avs-device\l-sdk/CapabilityAgents\l/SpeechSynthesizer/test\l/SpeechSynthesizerTest.cpp",height=0.2,width=0.4,color="black", fillcolor="white", style="filled",URL="$_speech_synthesizer_test_8cpp.html"];
  Node1 -> Node10 [dir="back",color="midnightblue",fontsize="10",style="solid",fontname="Helvetica"];
  Node10 [label="/workplace/avs-device\l-sdk/AVSCommon/Utils\l/test/StopwatchTest.cpp",height=0.2,width=0.4,color="black", fillcolor="white", style="filled",URL="$_stopwatch_test_8cpp.html"];
  Node1 -> Node11 [dir="back",color="midnightblue",fontsize="10",style="solid",fontname="Helvetica"];
  Node11 [label="/workplace/avs-device\l-sdk/CapabilityAgents\l/AudioPlayer/test/ProgressTimer\lTest.cpp",height=0.2,width=0.4,color="black", fillcolor="white", style="filled",URL="$_progress_timer_test_8cpp.html"];
}
