digraph "/workplace/avs-device-sdk/PlaylistParser/include/PlaylistParser/PlaylistUtils.h"
{
  edge [fontname="Helvetica",fontsize="10",labelfontname="Helvetica",labelfontsize="10"];
  node [fontname="Helvetica",fontsize="10",shape=record];
  Node1 [label="/workplace/avs-device\l-sdk/PlaylistParser/include\l/PlaylistParser/PlaylistUtils.h",height=0.2,width=0.4,color="black", fillcolor="grey75", style="filled", fontcolor="black"];
  Node1 -> Node2 [color="midnightblue",fontsize="10",style="solid",fontname="Helvetica"];
  Node2 [label="chrono",height=0.2,width=0.4,color="grey75", fillcolor="white", style="filled"];
  Node1 -> Node3 [color="midnightblue",fontsize="10",style="solid",fontname="Helvetica"];
  Node3 [label="string",height=0.2,width=0.4,color="grey75", fillcolor="white", style="filled"];
  Node1 -> Node4 [color="midnightblue",fontsize="10",style="solid",fontname="Helvetica"];
  Node4 [label="vector",height=0.2,width=0.4,color="grey75", fillcolor="white", style="filled"];
  Node1 -> Node5 [color="midnightblue",fontsize="10",style="solid",fontname="Helvetica"];
  Node5 [label="AVSCommon/SDKInterfaces\l/HTTPContentFetcherInterface.h",height=0.2,width=0.4,color="black", fillcolor="white", style="filled",URL="$_h_t_t_p_content_fetcher_interface_8h.html"];
  Node5 -> Node6 [color="midnightblue",fontsize="10",style="solid",fontname="Helvetica"];
  Node6 [label="memory",height=0.2,width=0.4,color="grey75", fillcolor="white", style="filled"];
  Node5 -> Node7 [color="midnightblue",fontsize="10",style="solid",fontname="Helvetica"];
  Node7 [label="AVSCommon/Utils/HTTP\l/HttpResponseCode.h",height=0.2,width=0.4,color="black", fillcolor="white", style="filled",URL="$_http_response_code_8h.html"];
  Node7 -> Node8 [color="midnightblue",fontsize="10",style="solid",fontname="Helvetica"];
  Node8 [label="iostream",height=0.2,width=0.4,color="grey75", fillcolor="white", style="filled"];
  Node7 -> Node3 [color="midnightblue",fontsize="10",style="solid",fontname="Helvetica"];
  Node7 -> Node9 [color="midnightblue",fontsize="10",style="solid",fontname="Helvetica"];
  Node9 [label="AVSCommon/Utils/Logger\l/LoggerUtils.h",height=0.2,width=0.4,color="black", fillcolor="white", style="filled",URL="$_logger_utils_8h.html"];
  Node9 -> Node2 [color="midnightblue",fontsize="10",style="solid",fontname="Helvetica"];
  Node9 -> Node10 [color="midnightblue",fontsize="10",style="solid",fontname="Helvetica"];
  Node10 [label="AVSCommon/Utils/Logger\l/Logger.h",height=0.2,width=0.4,color="black", fillcolor="white", style="filled",URL="$_logger_8h.html"];
  Node10 -> Node11 [color="midnightblue",fontsize="10",style="solid",fontname="Helvetica"];
  Node11 [label="atomic",height=0.2,width=0.4,color="grey75", fillcolor="white", style="filled"];
  Node10 -> Node2 [color="midnightblue",fontsize="10",style="solid",fontname="Helvetica"];
  Node10 -> Node12 [color="midnightblue",fontsize="10",style="solid",fontname="Helvetica"];
  Node12 [label="mutex",height=0.2,width=0.4,color="grey75", fillcolor="white", style="filled"];
  Node10 -> Node13 [color="midnightblue",fontsize="10",style="solid",fontname="Helvetica"];
  Node13 [label="sstream",height=0.2,width=0.4,color="grey75", fillcolor="white", style="filled"];
  Node10 -> Node4 [color="midnightblue",fontsize="10",style="solid",fontname="Helvetica"];
  Node10 -> Node14 [color="midnightblue",fontsize="10",style="solid",fontname="Helvetica"];
  Node14 [label="AVSCommon/Utils/Configuration\l/ConfigurationNode.h",height=0.2,width=0.4,color="black", fillcolor="white", style="filled",URL="$_configuration_node_8h.html"];
  Node14 -> Node2 [color="midnightblue",fontsize="10",style="solid",fontname="Helvetica"];
  Node14 -> Node8 [color="midnightblue",fontsize="10",style="solid",fontname="Helvetica"];
  Node14 -> Node6 [color="midnightblue",fontsize="10",style="solid",fontname="Helvetica"];
  Node14 -> Node12 [color="midnightblue",fontsize="10",style="solid",fontname="Helvetica"];
  Node14 -> Node3 [color="midnightblue",fontsize="10",style="solid",fontname="Helvetica"];
  Node14 -> Node4 [color="midnightblue",fontsize="10",style="solid",fontname="Helvetica"];
  Node14 -> Node15 [color="midnightblue",fontsize="10",style="solid",fontname="Helvetica"];
  Node15 [label="rapidjson/document.h",height=0.2,width=0.4,color="grey75", fillcolor="white", style="filled"];
  Node10 -> Node16 [color="midnightblue",fontsize="10",style="solid",fontname="Helvetica"];
  Node16 [label="AVSCommon/Utils/Logger\l/Level.h",height=0.2,width=0.4,color="black", fillcolor="white", style="filled",URL="$_level_8h.html"];
  Node16 -> Node3 [color="midnightblue",fontsize="10",style="solid",fontname="Helvetica"];
  Node10 -> Node17 [color="midnightblue",fontsize="10",style="solid",fontname="Helvetica"];
  Node17 [label="AVSCommon/Utils/Logger\l/LogEntry.h",height=0.2,width=0.4,color="black", fillcolor="white", style="filled",URL="$_log_entry_8h.html"];
  Node17 -> Node13 [color="midnightblue",fontsize="10",style="solid",fontname="Helvetica"];
  Node17 -> Node3 [color="midnightblue",fontsize="10",style="solid",fontname="Helvetica"];
  Node17 -> Node18 [color="midnightblue",fontsize="10",style="solid",fontname="Helvetica"];
  Node18 [label="AVSCommon/Utils/Logger\l/LogEntryStream.h",height=0.2,width=0.4,color="black", fillcolor="white", style="filled",URL="$_log_entry_stream_8h.html"];
  Node18 -> Node19 [color="midnightblue",fontsize="10",style="solid",fontname="Helvetica"];
  Node19 [label="ostream",height=0.2,width=0.4,color="grey75", fillcolor="white", style="filled"];
  Node18 -> Node20 [color="midnightblue",fontsize="10",style="solid",fontname="Helvetica"];
  Node20 [label="AVSCommon/Utils/Logger\l/LogEntryBuffer.h",height=0.2,width=0.4,color="black", fillcolor="white", style="filled",URL="$_log_entry_buffer_8h.html"];
  Node20 -> Node6 [color="midnightblue",fontsize="10",style="solid",fontname="Helvetica"];
  Node20 -> Node21 [color="midnightblue",fontsize="10",style="solid",fontname="Helvetica"];
  Node21 [label="streambuf",height=0.2,width=0.4,color="grey75", fillcolor="white", style="filled"];
  Node20 -> Node4 [color="midnightblue",fontsize="10",style="solid",fontname="Helvetica"];
  Node10 -> Node22 [color="midnightblue",fontsize="10",style="solid",fontname="Helvetica"];
  Node22 [label="AVSCommon/Utils/Logger\l/LogLevelObserverInterface.h",height=0.2,width=0.4,color="black", fillcolor="white", style="filled",URL="$_log_level_observer_interface_8h.html"];
  Node22 -> Node16 [color="midnightblue",fontsize="10",style="solid",fontname="Helvetica"];
  Node10 -> Node23 [color="midnightblue",fontsize="10",style="solid",fontname="Helvetica"];
  Node23 [label="AVSCommon/Utils/Logger\l/SinkObserverInterface.h",height=0.2,width=0.4,color="black", fillcolor="white", style="filled",URL="$_sink_observer_interface_8h.html"];
  Node23 -> Node6 [color="midnightblue",fontsize="10",style="solid",fontname="Helvetica"];
  Node5 -> Node24 [color="midnightblue",fontsize="10",style="solid",fontname="Helvetica"];
  Node24 [label="AVSCommon/Utils/HTTPContent.h",height=0.2,width=0.4,color="black", fillcolor="white", style="filled",URL="$_h_t_t_p_content_8h.html"];
  Node24 -> Node2 [color="midnightblue",fontsize="10",style="solid",fontname="Helvetica"];
  Node24 -> Node25 [color="midnightblue",fontsize="10",style="solid",fontname="Helvetica"];
  Node25 [label="future",height=0.2,width=0.4,color="grey75", fillcolor="white", style="filled"];
  Node24 -> Node6 [color="midnightblue",fontsize="10",style="solid",fontname="Helvetica"];
  Node24 -> Node3 [color="midnightblue",fontsize="10",style="solid",fontname="Helvetica"];
  Node24 -> Node26 [color="midnightblue",fontsize="10",style="solid",fontname="Helvetica"];
  Node26 [label="AVSCommon/AVS/Attachment\l/InProcessAttachment.h",height=0.2,width=0.4,color="black", fillcolor="white", style="filled",URL="$_in_process_attachment_8h.html"];
  Node26 -> Node27 [color="midnightblue",fontsize="10",style="solid",fontname="Helvetica"];
  Node27 [label="AVSCommon/AVS/Attachment\l/Attachment.h",height=0.2,width=0.4,color="black", fillcolor="white", style="filled",URL="$_attachment_8h.html"];
  Node27 -> Node11 [color="midnightblue",fontsize="10",style="solid",fontname="Helvetica"];
  Node27 -> Node12 [color="midnightblue",fontsize="10",style="solid",fontname="Helvetica"];
  Node27 -> Node3 [color="midnightblue",fontsize="10",style="solid",fontname="Helvetica"];
  Node27 -> Node28 [color="midnightblue",fontsize="10",style="solid",fontname="Helvetica"];
  Node28 [label="AVSCommon/AVS/Attachment\l/AttachmentReader.h",height=0.2,width=0.4,color="black", fillcolor="white", style="filled",URL="$_attachment_reader_8h.html"];
  Node28 -> Node2 [color="midnightblue",fontsize="10",style="solid",fontname="Helvetica"];
  Node28 -> Node29 [color="midnightblue",fontsize="10",style="solid",fontname="Helvetica"];
  Node29 [label="cstddef",height=0.2,width=0.4,color="grey75", fillcolor="white", style="filled"];
  Node28 -> Node19 [color="midnightblue",fontsize="10",style="solid",fontname="Helvetica"];
  Node28 -> Node30 [color="midnightblue",fontsize="10",style="solid",fontname="Helvetica"];
  Node30 [label="AVSCommon/Utils/SDS\l/ReaderPolicy.h",height=0.2,width=0.4,color="black", fillcolor="white", style="filled",URL="$_reader_policy_8h.html"];
  Node27 -> Node31 [color="midnightblue",fontsize="10",style="solid",fontname="Helvetica"];
  Node31 [label="AVSCommon/AVS/Attachment\l/AttachmentWriter.h",height=0.2,width=0.4,color="black", fillcolor="white", style="filled",URL="$_attachment_writer_8h.html"];
  Node31 -> Node2 [color="midnightblue",fontsize="10",style="solid",fontname="Helvetica"];
  Node31 -> Node29 [color="midnightblue",fontsize="10",style="solid",fontname="Helvetica"];
  Node27 -> Node32 [color="midnightblue",fontsize="10",style="solid",fontname="Helvetica"];
  Node32 [label="AVSCommon/Utils/SDS\l/InProcessSDS.h",height=0.2,width=0.4,color="black", fillcolor="white", style="filled",URL="$_in_process_s_d_s_8h.html"];
  Node32 -> Node4 [color="midnightblue",fontsize="10",style="solid",fontname="Helvetica"];
  Node32 -> Node12 [color="midnightblue",fontsize="10",style="solid",fontname="Helvetica"];
  Node32 -> Node11 [color="midnightblue",fontsize="10",style="solid",fontname="Helvetica"];
  Node32 -> Node33 [color="midnightblue",fontsize="10",style="solid",fontname="Helvetica"];
  Node33 [label="condition_variable",height=0.2,width=0.4,color="grey75", fillcolor="white", style="filled"];
  Node32 -> Node3 [color="midnightblue",fontsize="10",style="solid",fontname="Helvetica"];
  Node32 -> Node34 [color="midnightblue",fontsize="10",style="solid",fontname="Helvetica"];
  Node34 [label="SharedDataStream.h",height=0.2,width=0.4,color="black", fillcolor="white", style="filled",URL="$_shared_data_stream_8h.html"];
  Node34 -> Node35 [color="midnightblue",fontsize="10",style="solid",fontname="Helvetica"];
  Node35 [label="cstdint",height=0.2,width=0.4,color="grey75", fillcolor="white", style="filled"];
  Node34 -> Node29 [color="midnightblue",fontsize="10",style="solid",fontname="Helvetica"];
  Node34 -> Node6 [color="midnightblue",fontsize="10",style="solid",fontname="Helvetica"];
  Node34 -> Node9 [color="midnightblue",fontsize="10",style="solid",fontname="Helvetica"];
  Node34 -> Node36 [color="midnightblue",fontsize="10",style="solid",fontname="Helvetica"];
  Node36 [label="BufferLayout.h",height=0.2,width=0.4,color="black", fillcolor="white", style="filled",URL="$_buffer_layout_8h.html"];
  Node36 -> Node35 [color="midnightblue",fontsize="10",style="solid",fontname="Helvetica"];
  Node36 -> Node29 [color="midnightblue",fontsize="10",style="solid",fontname="Helvetica"];
  Node36 -> Node12 [color="midnightblue",fontsize="10",style="solid",fontname="Helvetica"];
  Node36 -> Node3 [color="midnightblue",fontsize="10",style="solid",fontname="Helvetica"];
  Node36 -> Node4 [color="midnightblue",fontsize="10",style="solid",fontname="Helvetica"];
  Node36 -> Node9 [color="midnightblue",fontsize="10",style="solid",fontname="Helvetica"];
  Node36 -> Node34 [color="midnightblue",fontsize="10",style="solid",fontname="Helvetica"];
  Node34 -> Node37 [color="midnightblue",fontsize="10",style="solid",fontname="Helvetica"];
  Node37 [label="Reader.h",height=0.2,width=0.4,color="black", fillcolor="white", style="filled",URL="$_reader_8h.html"];
  Node37 -> Node35 [color="midnightblue",fontsize="10",style="solid",fontname="Helvetica"];
  Node37 -> Node29 [color="midnightblue",fontsize="10",style="solid",fontname="Helvetica"];
  Node37 -> Node4 [color="midnightblue",fontsize="10",style="solid",fontname="Helvetica"];
  Node37 -> Node12 [color="midnightblue",fontsize="10",style="solid",fontname="Helvetica"];
  Node37 -> Node38 [color="midnightblue",fontsize="10",style="solid",fontname="Helvetica"];
  Node38 [label="limits",height=0.2,width=0.4,color="grey75", fillcolor="white", style="filled"];
  Node37 -> Node39 [color="midnightblue",fontsize="10",style="solid",fontname="Helvetica"];
  Node39 [label="cstring",height=0.2,width=0.4,color="grey75", fillcolor="white", style="filled"];
  Node37 -> Node9 [color="midnightblue",fontsize="10",style="solid",fontname="Helvetica"];
  Node37 -> Node34 [color="midnightblue",fontsize="10",style="solid",fontname="Helvetica"];
  Node37 -> Node30 [color="midnightblue",fontsize="10",style="solid",fontname="Helvetica"];
  Node34 -> Node40 [color="midnightblue",fontsize="10",style="solid",fontname="Helvetica"];
  Node40 [label="Writer.h",height=0.2,width=0.4,color="black", fillcolor="white", style="filled",URL="$_writer_8h.html"];
  Node40 -> Node35 [color="midnightblue",fontsize="10",style="solid",fontname="Helvetica"];
  Node40 -> Node29 [color="midnightblue",fontsize="10",style="solid",fontname="Helvetica"];
  Node40 -> Node4 [color="midnightblue",fontsize="10",style="solid",fontname="Helvetica"];
  Node40 -> Node12 [color="midnightblue",fontsize="10",style="solid",fontname="Helvetica"];
  Node40 -> Node38 [color="midnightblue",fontsize="10",style="solid",fontname="Helvetica"];
  Node40 -> Node39 [color="midnightblue",fontsize="10",style="solid",fontname="Helvetica"];
  Node40 -> Node9 [color="midnightblue",fontsize="10",style="solid",fontname="Helvetica"];
  Node40 -> Node34 [color="midnightblue",fontsize="10",style="solid",fontname="Helvetica"];
  Node40 -> Node41 [color="midnightblue",fontsize="10",style="solid",fontname="Helvetica"];
  Node41 [label="WriterPolicy.h",height=0.2,width=0.4,color="black", fillcolor="white", style="filled",URL="$_writer_policy_8h.html"];
  Node27 -> Node30 [color="midnightblue",fontsize="10",style="solid",fontname="Helvetica"];
  Node27 -> Node41 [color="midnightblue",fontsize="10",style="solid",fontname="Helvetica"];
  Node26 -> Node42 [color="midnightblue",fontsize="10",style="solid",fontname="Helvetica"];
  Node42 [label="AVSCommon/AVS/Attachment\l/InProcessAttachmentReader.h",height=0.2,width=0.4,color="black", fillcolor="white", style="filled",URL="$_in_process_attachment_reader_8h.html"];
  Node42 -> Node32 [color="midnightblue",fontsize="10",style="solid",fontname="Helvetica"];
  Node42 -> Node37 [color="midnightblue",fontsize="10",style="solid",fontname="Helvetica"];
  Node42 -> Node28 [color="midnightblue",fontsize="10",style="solid",fontname="Helvetica"];
  Node26 -> Node43 [color="midnightblue",fontsize="10",style="solid",fontname="Helvetica"];
  Node43 [label="AVSCommon/AVS/Attachment\l/InProcessAttachmentWriter.h",height=0.2,width=0.4,color="black", fillcolor="white", style="filled",URL="$_in_process_attachment_writer_8h.html"];
  Node43 -> Node32 [color="midnightblue",fontsize="10",style="solid",fontname="Helvetica"];
  Node43 -> Node40 [color="midnightblue",fontsize="10",style="solid",fontname="Helvetica"];
  Node43 -> Node31 [color="midnightblue",fontsize="10",style="solid",fontname="Helvetica"];
  Node26 -> Node32 [color="midnightblue",fontsize="10",style="solid",fontname="Helvetica"];
  Node5 -> Node44 [color="midnightblue",fontsize="10",style="solid",fontname="Helvetica"];
  Node44 [label="AVSCommon/Utils/SDKVersion.h",height=0.2,width=0.4,color="black", fillcolor="white", style="filled",URL="$_s_d_k_version_8h.html"];
  Node44 -> Node3 [color="midnightblue",fontsize="10",style="solid",fontname="Helvetica"];
}
