digraph "alexaClientSDK::capabilityAgents::alerts::AlertsCapabilityAgent"
{
  edge [fontname="Helvetica",fontsize="10",labelfontname="Helvetica",labelfontsize="10"];
  node [fontname="Helvetica",fontsize="10",shape=record];
  rankdir="LR";
  Node1 [label="alexaClientSDK::capability\lAgents::alerts::AlertsCapabilityAgent",height=0.2,width=0.4,color="black", fillcolor="grey75", style="filled", fontcolor="black"];
  Node2 -> Node1 [dir="back",color="midnightblue",fontsize="10",style="solid",fontname="Helvetica"];
  Node2 [label="alexaClientSDK::avsCommon\l::avs::CapabilityAgent",height=0.2,width=0.4,color="black", fillcolor="white", style="filled",URL="$classalexa_client_s_d_k_1_1avs_common_1_1avs_1_1_capability_agent.html"];
  Node3 -> Node2 [dir="back",color="midnightblue",fontsize="10",style="solid",fontname="Helvetica"];
  Node3 [label="alexaClientSDK::avsCommon\l::sdkInterfaces::DirectiveHandler\lInterface",height=0.2,width=0.4,color="black", fillcolor="white", style="filled",URL="$classalexa_client_s_d_k_1_1avs_common_1_1sdk_interfaces_1_1_directive_handler_interface.html"];
  Node4 -> Node2 [dir="back",color="midnightblue",fontsize="10",style="solid",fontname="Helvetica"];
  Node4 [label="alexaClientSDK::avsCommon\l::sdkInterfaces::ChannelObserver\lInterface",height=0.2,width=0.4,color="black", fillcolor="white", style="filled",URL="$classalexa_client_s_d_k_1_1avs_common_1_1sdk_interfaces_1_1_channel_observer_interface.html"];
  Node5 -> Node2 [dir="back",color="midnightblue",fontsize="10",style="solid",fontname="Helvetica"];
  Node5 [label="alexaClientSDK::avsCommon\l::sdkInterfaces::StateProvider\lInterface",height=0.2,width=0.4,color="black", fillcolor="white", style="filled",URL="$classalexa_client_s_d_k_1_1avs_common_1_1sdk_interfaces_1_1_state_provider_interface.html"];
  Node6 -> Node2 [dir="back",color="midnightblue",fontsize="10",style="solid",fontname="Helvetica"];
  Node6 [label="alexaClientSDK::avsCommon\l::sdkInterfaces::ContextRequester\lInterface",height=0.2,width=0.4,color="black", fillcolor="white", style="filled",URL="$classalexa_client_s_d_k_1_1avs_common_1_1sdk_interfaces_1_1_context_requester_interface.html"];
  Node7 -> Node1 [dir="back",color="midnightblue",fontsize="10",style="solid",fontname="Helvetica"];
  Node7 [label="alexaClientSDK::avsCommon\l::sdkInterfaces::ConnectionStatus\lObserverInterface",height=0.2,width=0.4,color="black", fillcolor="white", style="filled",URL="$classalexa_client_s_d_k_1_1avs_common_1_1sdk_interfaces_1_1_connection_status_observer_interface.html"];
  Node8 -> Node1 [dir="back",color="midnightblue",fontsize="10",style="solid",fontname="Helvetica"];
  Node8 [label="alexaClientSDK::avsCommon\l::sdkInterfaces::CapabilityConfiguration\lInterface",height=0.2,width=0.4,color="black", fillcolor="white", style="filled",URL="$classalexa_client_s_d_k_1_1avs_common_1_1sdk_interfaces_1_1_capability_configuration_interface.html"];
  Node9 -> Node1 [dir="back",color="midnightblue",fontsize="10",style="solid",fontname="Helvetica"];
  Node9 [label="alexaClientSDK::avsCommon\l::sdkInterfaces::SpeakerManager\lObserverInterface",height=0.2,width=0.4,color="black", fillcolor="white", style="filled",URL="$classalexa_client_s_d_k_1_1avs_common_1_1sdk_interfaces_1_1_speaker_manager_observer_interface.html"];
  Node10 -> Node1 [dir="back",color="midnightblue",fontsize="10",style="solid",fontname="Helvetica"];
  Node10 [label="alexaClientSDK::avsCommon\l::sdkInterfaces::FocusManagerObserver\lInterface",height=0.2,width=0.4,color="black", fillcolor="white", style="filled",URL="$classalexa_client_s_d_k_1_1avs_common_1_1sdk_interfaces_1_1_focus_manager_observer_interface.html",tooltip="An interface that clients can extend to register to observe focus changes. "];
  Node11 -> Node1 [dir="back",color="midnightblue",fontsize="10",style="solid",fontname="Helvetica"];
  Node11 [label="alexaClientSDK::capability\lAgents::alerts::AlertObserverInterface",height=0.2,width=0.4,color="black", fillcolor="white", style="filled",URL="$classalexa_client_s_d_k_1_1capability_agents_1_1alerts_1_1_alert_observer_interface.html"];
  Node12 -> Node1 [dir="back",color="midnightblue",fontsize="10",style="solid",fontname="Helvetica"];
  Node12 [label="alexaClientSDK::avsCommon\l::utils::RequiresShutdown",height=0.2,width=0.4,color="black", fillcolor="white", style="filled",URL="$classalexa_client_s_d_k_1_1avs_common_1_1utils_1_1_requires_shutdown.html"];
  Node13 -> Node1 [dir="back",color="midnightblue",fontsize="10",style="solid",fontname="Helvetica"];
  Node13 [label="alexaClientSDK::registration\lManager::CustomerDataHandler",height=0.2,width=0.4,color="black", fillcolor="white", style="filled",URL="$classalexa_client_s_d_k_1_1registration_manager_1_1_customer_data_handler.html"];
  Node14 -> Node1 [dir="back",color="midnightblue",fontsize="10",style="solid",fontname="Helvetica"];
  Node14 [label="std::enable_shared\l_from_this\< AlertsCapability\lAgent \>",height=0.2,width=0.4,color="grey75", fillcolor="white", style="filled"];
}
