digraph "/workplace/avs-device-sdk/ApplicationUtilities/AndroidUtilities/test/AndroidUtilities/MockAndroidSLESInterface.h"
{
  edge [fontname="Helvetica",fontsize="10",labelfontname="Helvetica",labelfontsize="10"];
  node [fontname="Helvetica",fontsize="10",shape=record];
  Node1 [label="/workplace/avs-device\l-sdk/ApplicationUtilities\l/AndroidUtilities/test/AndroidUtilities\l/MockAndroidSLESInterface.h",height=0.2,width=0.4,color="black", fillcolor="grey75", style="filled", fontcolor="black"];
  Node1 -> Node2 [dir="back",color="midnightblue",fontsize="10",style="solid",fontname="Helvetica"];
  Node2 [label="/workplace/avs-device\l-sdk/ApplicationUtilities\l/AndroidUtilities/test/AndroidSLESBuffer\lQueueTest.cpp",height=0.2,width=0.4,color="black", fillcolor="white", style="filled",URL="$_android_s_l_e_s_buffer_queue_test_8cpp.html"];
  Node1 -> Node3 [dir="back",color="midnightblue",fontsize="10",style="solid",fontname="Helvetica"];
  Node3 [label="/workplace/avs-device\l-sdk/ApplicationUtilities\l/AndroidUtilities/test/AndroidUtilities\l/MockAndroidSLESObject.h",height=0.2,width=0.4,color="black", fillcolor="white", style="filled",URL="$_mock_android_s_l_e_s_object_8h.html"];
  Node3 -> Node2 [dir="back",color="midnightblue",fontsize="10",style="solid",fontname="Helvetica"];
  Node3 -> Node4 [dir="back",color="midnightblue",fontsize="10",style="solid",fontname="Helvetica"];
  Node4 [label="/workplace/avs-device\l-sdk/MediaPlayer/AndroidSLESMedia\lPlayer/test/AndroidSLESMediaQueueTest.cpp",height=0.2,width=0.4,color="black", fillcolor="white", style="filled",URL="$_android_s_l_e_s_media_queue_test_8cpp.html"];
  Node3 -> Node5 [dir="back",color="midnightblue",fontsize="10",style="solid",fontname="Helvetica"];
  Node5 [label="/workplace/avs-device\l-sdk/MediaPlayer/AndroidSLESMedia\lPlayer/test/AndroidSLESSpeakerTest.cpp",height=0.2,width=0.4,color="black", fillcolor="white", style="filled",URL="$_android_s_l_e_s_speaker_test_8cpp.html"];
}
