digraph "/workplace/avs-device-sdk/BluetoothImplementations/BlueZ/include/BlueZ/DBusObject.h"
{
  edge [fontname="Helvetica",fontsize="10",labelfontname="Helvetica",labelfontsize="10"];
  node [fontname="Helvetica",fontsize="10",shape=record];
  Node1 [label="/workplace/avs-device\l-sdk/BluetoothImplementations\l/BlueZ/include/BlueZ/DBusObject.h",height=0.2,width=0.4,color="black", fillcolor="grey75", style="filled", fontcolor="black"];
  Node1 -> Node2 [dir="back",color="midnightblue",fontsize="10",style="solid",fontname="Helvetica"];
  Node2 [label="/workplace/avs-device\l-sdk/BluetoothImplementations\l/BlueZ/include/BlueZ/MPRISPlayer.h",height=0.2,width=0.4,color="black", fillcolor="white", style="filled",URL="$_m_p_r_i_s_player_8h.html"];
  Node2 -> Node3 [dir="back",color="midnightblue",fontsize="10",style="solid",fontname="Helvetica"];
  Node3 [label="/workplace/avs-device\l-sdk/BluetoothImplementations\l/BlueZ/include/BlueZ/BlueZDeviceManager.h",height=0.2,width=0.4,color="black", fillcolor="white", style="filled",URL="$_blue_z_device_manager_8h.html"];
  Node3 -> Node4 [dir="back",color="midnightblue",fontsize="10",style="solid",fontname="Helvetica"];
  Node4 [label="/workplace/avs-device\l-sdk/BluetoothImplementations\l/BlueZ/include/BlueZ/BlueZBluetooth\lDeviceManager.h",height=0.2,width=0.4,color="black", fillcolor="white", style="filled",URL="$_blue_z_bluetooth_device_manager_8h.html"];
  Node4 -> Node5 [dir="back",color="midnightblue",fontsize="10",style="solid",fontname="Helvetica"];
  Node5 [label="/workplace/avs-device\l-sdk/BluetoothImplementations\l/BlueZ/src/BlueZBluetoothDeviceManager.cpp",height=0.2,width=0.4,color="black", fillcolor="white", style="filled",URL="$_blue_z_bluetooth_device_manager_8cpp.html"];
  Node3 -> Node6 [dir="back",color="midnightblue",fontsize="10",style="solid",fontname="Helvetica"];
  Node6 [label="/workplace/avs-device\l-sdk/BluetoothImplementations\l/BlueZ/include/BlueZ/MediaEndpoint.h",height=0.2,width=0.4,color="black", fillcolor="white", style="filled",URL="$_media_endpoint_8h.html"];
  Node6 -> Node7 [dir="back",color="midnightblue",fontsize="10",style="solid",fontname="Helvetica"];
  Node7 [label="/workplace/avs-device\l-sdk/BluetoothImplementations\l/BlueZ/src/BlueZA2DPSource.cpp",height=0.2,width=0.4,color="black", fillcolor="white", style="filled",URL="$_blue_z_a2_d_p_source_8cpp.html"];
  Node6 -> Node8 [dir="back",color="midnightblue",fontsize="10",style="solid",fontname="Helvetica"];
  Node8 [label="/workplace/avs-device\l-sdk/BluetoothImplementations\l/BlueZ/src/BlueZDeviceManager.cpp",height=0.2,width=0.4,color="black", fillcolor="white", style="filled",URL="$_blue_z_device_manager_8cpp.html"];
  Node6 -> Node9 [dir="back",color="midnightblue",fontsize="10",style="solid",fontname="Helvetica"];
  Node9 [label="/workplace/avs-device\l-sdk/BluetoothImplementations\l/BlueZ/src/MediaEndpoint.cpp",height=0.2,width=0.4,color="black", fillcolor="white", style="filled",URL="$_media_endpoint_8cpp.html"];
  Node3 -> Node10 [dir="back",color="midnightblue",fontsize="10",style="solid",fontname="Helvetica"];
  Node10 [label="/workplace/avs-device\l-sdk/BluetoothImplementations\l/BlueZ/src/BlueZA2DPSink.cpp",height=0.2,width=0.4,color="black", fillcolor="white", style="filled",URL="$_blue_z_a2_d_p_sink_8cpp.html"];
  Node3 -> Node7 [dir="back",color="midnightblue",fontsize="10",style="solid",fontname="Helvetica"];
  Node3 -> Node11 [dir="back",color="midnightblue",fontsize="10",style="solid",fontname="Helvetica"];
  Node11 [label="/workplace/avs-device\l-sdk/BluetoothImplementations\l/BlueZ/src/BlueZBluetoothDevice.cpp",height=0.2,width=0.4,color="black", fillcolor="white", style="filled",URL="$_blue_z_bluetooth_device_8cpp.html"];
  Node3 -> Node8 [dir="back",color="midnightblue",fontsize="10",style="solid",fontname="Helvetica"];
  Node3 -> Node12 [dir="back",color="midnightblue",fontsize="10",style="solid",fontname="Helvetica"];
  Node12 [label="/workplace/avs-device\l-sdk/BluetoothImplementations\l/BlueZ/src/BlueZHostController.cpp",height=0.2,width=0.4,color="black", fillcolor="white", style="filled",URL="$_blue_z_host_controller_8cpp.html"];
  Node3 -> Node13 [dir="back",color="midnightblue",fontsize="10",style="solid",fontname="Helvetica"];
  Node13 [label="/workplace/avs-device\l-sdk/BluetoothImplementations\l/BlueZ/src/DBusPropertiesProxy.cpp",height=0.2,width=0.4,color="black", fillcolor="white", style="filled",URL="$_d_bus_properties_proxy_8cpp.html"];
  Node3 -> Node14 [dir="back",color="midnightblue",fontsize="10",style="solid",fontname="Helvetica"];
  Node14 [label="/workplace/avs-device\l-sdk/BluetoothImplementations\l/BlueZ/src/MPRISPlayer.cpp",height=0.2,width=0.4,color="black", fillcolor="white", style="filled",URL="$_m_p_r_i_s_player_8cpp.html"];
  Node3 -> Node15 [dir="back",color="midnightblue",fontsize="10",style="solid",fontname="Helvetica"];
  Node15 [label="/workplace/avs-device\l-sdk/BluetoothImplementations\l/BlueZ/src/PairingAgent.cpp",height=0.2,width=0.4,color="black", fillcolor="white", style="filled",URL="$_pairing_agent_8cpp.html"];
  Node2 -> Node14 [dir="back",color="midnightblue",fontsize="10",style="solid",fontname="Helvetica"];
  Node2 -> Node16 [dir="back",color="midnightblue",fontsize="10",style="solid",fontname="Helvetica"];
  Node16 [label="/workplace/avs-device\l-sdk/BluetoothImplementations\l/BlueZ/test/MPRISPlayerTest.cpp",height=0.2,width=0.4,color="black", fillcolor="white", style="filled",URL="$_m_p_r_i_s_player_test_8cpp.html"];
  Node1 -> Node17 [dir="back",color="midnightblue",fontsize="10",style="solid",fontname="Helvetica"];
  Node17 [label="/workplace/avs-device\l-sdk/BluetoothImplementations\l/BlueZ/include/BlueZ/PairingAgent.h",height=0.2,width=0.4,color="black", fillcolor="white", style="filled",URL="$_pairing_agent_8h.html"];
  Node17 -> Node3 [dir="back",color="midnightblue",fontsize="10",style="solid",fontname="Helvetica"];
  Node17 -> Node15 [dir="back",color="midnightblue",fontsize="10",style="solid",fontname="Helvetica"];
}
