digraph "/workplace/avs-device-sdk/AVSCommon/Utils/include/AVSCommon/Utils/JSON/JSONGenerator.h"
{
  edge [fontname="Helvetica",fontsize="10",labelfontname="Helvetica",labelfontsize="10"];
  node [fontname="Helvetica",fontsize="10",shape=record];
  Node1 [label="/workplace/avs-device\l-sdk/AVSCommon/Utils\l/include/AVSCommon/Utils\l/JSON/JSONGenerator.h",height=0.2,width=0.4,color="black", fillcolor="grey75", style="filled", fontcolor="black"];
  Node1 -> Node2 [dir="back",color="midnightblue",fontsize="10",style="solid",fontname="Helvetica"];
  Node2 [label="/workplace/avs-device\l-sdk/AVSCommon/Utils\l/src/JSON/JSONGenerator.cpp",height=0.2,width=0.4,color="black", fillcolor="white", style="filled",URL="$_j_s_o_n_generator_8cpp.html"];
  Node1 -> Node3 [dir="back",color="midnightblue",fontsize="10",style="solid",fontname="Helvetica"];
  Node3 [label="/workplace/avs-device\l-sdk/AVSCommon/Utils\l/test/JSONGeneratorTest.cpp",height=0.2,width=0.4,color="black", fillcolor="white", style="filled",URL="$_j_s_o_n_generator_test_8cpp.html"];
  Node1 -> Node4 [dir="back",color="midnightblue",fontsize="10",style="solid",fontname="Helvetica"];
  Node4 [label="/workplace/avs-device\l-sdk/CapabilityAgents\l/AIP/src/AudioInputProcessor.cpp",height=0.2,width=0.4,color="black", fillcolor="white", style="filled",URL="$_audio_input_processor_8cpp.html"];
  Node1 -> Node5 [dir="back",color="midnightblue",fontsize="10",style="solid",fontname="Helvetica"];
  Node5 [label="/workplace/avs-device\l-sdk/CapabilityAgents\l/DoNotDisturb/src/DoNotDisturb\lCapabilityAgent.cpp",height=0.2,width=0.4,color="black", fillcolor="white", style="filled",URL="$_do_not_disturb_capability_agent_8cpp.html"];
  Node1 -> Node6 [dir="back",color="midnightblue",fontsize="10",style="solid",fontname="Helvetica"];
  Node6 [label="/workplace/avs-device\l-sdk/Settings/test/SettingString\lConversionTest.cpp",height=0.2,width=0.4,color="black", fillcolor="white", style="filled",URL="$_setting_string_conversion_test_8cpp.html"];
}
