digraph "/workplace/avs-device-sdk/CapabilityAgents/SpeechSynthesizer/include/SpeechSynthesizer/SpeechSynthesizer.h"
{
  edge [fontname="Helvetica",fontsize="10",labelfontname="Helvetica",labelfontsize="10"];
  node [fontname="Helvetica",fontsize="10",shape=record];
  Node1 [label="/workplace/avs-device\l-sdk/CapabilityAgents\l/SpeechSynthesizer/include\l/SpeechSynthesizer/SpeechSynthesizer.h",height=0.2,width=0.4,color="black", fillcolor="grey75", style="filled", fontcolor="black"];
  Node1 -> Node2 [color="midnightblue",fontsize="10",style="solid",fontname="Helvetica"];
  Node2 [label="memory",height=0.2,width=0.4,color="grey75", fillcolor="white", style="filled"];
  Node1 -> Node3 [color="midnightblue",fontsize="10",style="solid",fontname="Helvetica"];
  Node3 [label="mutex",height=0.2,width=0.4,color="grey75", fillcolor="white", style="filled"];
  Node1 -> Node4 [color="midnightblue",fontsize="10",style="solid",fontname="Helvetica"];
  Node4 [label="string",height=0.2,width=0.4,color="grey75", fillcolor="white", style="filled"];
  Node1 -> Node5 [color="midnightblue",fontsize="10",style="solid",fontname="Helvetica"];
  Node5 [label="unordered_set",height=0.2,width=0.4,color="grey75", fillcolor="white", style="filled"];
  Node1 -> Node6 [color="midnightblue",fontsize="10",style="solid",fontname="Helvetica"];
  Node6 [label="deque",height=0.2,width=0.4,color="grey75", fillcolor="white", style="filled"];
  Node1 -> Node7 [color="midnightblue",fontsize="10",style="solid",fontname="Helvetica"];
  Node7 [label="AVSCommon/AVS/AVSDirective.h",height=0.2,width=0.4,color="black", fillcolor="white", style="filled",URL="$_a_v_s_directive_8h.html"];
  Node7 -> Node8 [color="midnightblue",fontsize="10",style="solid",fontname="Helvetica"];
  Node8 [label="iostream",height=0.2,width=0.4,color="grey75", fillcolor="white", style="filled"];
  Node7 -> Node2 [color="midnightblue",fontsize="10",style="solid",fontname="Helvetica"];
  Node7 -> Node4 [color="midnightblue",fontsize="10",style="solid",fontname="Helvetica"];
  Node7 -> Node9 [color="midnightblue",fontsize="10",style="solid",fontname="Helvetica"];
  Node9 [label="utility",height=0.2,width=0.4,color="grey75", fillcolor="white", style="filled"];
  Node7 -> Node10 [color="midnightblue",fontsize="10",style="solid",fontname="Helvetica"];
  Node10 [label="Attachment/AttachmentManager\lInterface.h",height=0.2,width=0.4,color="red", fillcolor="white", style="filled",URL="$_attachment_manager_interface_8h.html"];
  Node10 -> Node11 [color="midnightblue",fontsize="10",style="solid",fontname="Helvetica"];
  Node11 [label="chrono",height=0.2,width=0.4,color="grey75", fillcolor="white", style="filled"];
  Node10 -> Node4 [color="midnightblue",fontsize="10",style="solid",fontname="Helvetica"];
  Node10 -> Node2 [color="midnightblue",fontsize="10",style="solid",fontname="Helvetica"];
  Node10 -> Node12 [color="midnightblue",fontsize="10",style="solid",fontname="Helvetica"];
  Node12 [label="AVSCommon/AVS/Attachment\l/AttachmentReader.h",height=0.2,width=0.4,color="red", fillcolor="white", style="filled",URL="$_attachment_reader_8h.html"];
  Node12 -> Node11 [color="midnightblue",fontsize="10",style="solid",fontname="Helvetica"];
  Node12 -> Node13 [color="midnightblue",fontsize="10",style="solid",fontname="Helvetica"];
  Node13 [label="ostream",height=0.2,width=0.4,color="grey75", fillcolor="white", style="filled"];
  Node7 -> Node14 [color="midnightblue",fontsize="10",style="solid",fontname="Helvetica"];
  Node14 [label="AVSMessage.h",height=0.2,width=0.4,color="red", fillcolor="white", style="filled",URL="$_a_v_s_message_8h.html"];
  Node14 -> Node2 [color="midnightblue",fontsize="10",style="solid",fontname="Helvetica"];
  Node14 -> Node4 [color="midnightblue",fontsize="10",style="solid",fontname="Helvetica"];
  Node1 -> Node15 [color="midnightblue",fontsize="10",style="solid",fontname="Helvetica"];
  Node15 [label="AVSCommon/AVS/Capability\lAgent.h",height=0.2,width=0.4,color="black", fillcolor="white", style="filled",URL="$_capability_agent_8h.html"];
  Node15 -> Node16 [color="midnightblue",fontsize="10",style="solid",fontname="Helvetica"];
  Node16 [label="atomic",height=0.2,width=0.4,color="grey75", fillcolor="white", style="filled"];
  Node15 -> Node17 [color="midnightblue",fontsize="10",style="solid",fontname="Helvetica"];
  Node17 [label="unordered_map",height=0.2,width=0.4,color="grey75", fillcolor="white", style="filled"];
  Node15 -> Node4 [color="midnightblue",fontsize="10",style="solid",fontname="Helvetica"];
  Node15 -> Node2 [color="midnightblue",fontsize="10",style="solid",fontname="Helvetica"];
  Node15 -> Node18 [color="midnightblue",fontsize="10",style="solid",fontname="Helvetica"];
  Node18 [label="AVSCommon/AVS/NamespaceAnd\lName.h",height=0.2,width=0.4,color="black", fillcolor="white", style="filled",URL="$_namespace_and_name_8h.html"];
  Node18 -> Node4 [color="midnightblue",fontsize="10",style="solid",fontname="Helvetica"];
  Node15 -> Node19 [color="midnightblue",fontsize="10",style="solid",fontname="Helvetica"];
  Node19 [label="AVSCommon/SDKInterfaces\l/ExceptionEncounteredSenderInterface.h",height=0.2,width=0.4,color="black", fillcolor="white", style="filled",URL="$_exception_encountered_sender_interface_8h.html"];
  Node19 -> Node20 [color="midnightblue",fontsize="10",style="solid",fontname="Helvetica"];
  Node20 [label="AVSCommon/AVS/ExceptionError\lType.h",height=0.2,width=0.4,color="black", fillcolor="white", style="filled",URL="$_exception_error_type_8h.html"];
  Node20 -> Node8 [color="midnightblue",fontsize="10",style="solid",fontname="Helvetica"];
  Node15 -> Node21 [color="midnightblue",fontsize="10",style="solid",fontname="Helvetica"];
  Node21 [label="AVSCommon/SDKInterfaces\l/ChannelObserverInterface.h",height=0.2,width=0.4,color="red", fillcolor="white", style="filled",URL="$_channel_observer_interface_8h.html"];
  Node15 -> Node22 [color="midnightblue",fontsize="10",style="solid",fontname="Helvetica"];
  Node22 [label="AVSCommon/SDKInterfaces\l/ContextRequesterInterface.h",height=0.2,width=0.4,color="black", fillcolor="white", style="filled",URL="$_context_requester_interface_8h.html"];
  Node22 -> Node4 [color="midnightblue",fontsize="10",style="solid",fontname="Helvetica"];
  Node22 -> Node13 [color="midnightblue",fontsize="10",style="solid",fontname="Helvetica"];
  Node15 -> Node23 [color="midnightblue",fontsize="10",style="solid",fontname="Helvetica"];
  Node23 [label="AVSCommon/SDKInterfaces\l/StateProviderInterface.h",height=0.2,width=0.4,color="black", fillcolor="white", style="filled",URL="$_state_provider_interface_8h.html"];
  Node23 -> Node18 [color="midnightblue",fontsize="10",style="solid",fontname="Helvetica"];
  Node15 -> Node24 [color="midnightblue",fontsize="10",style="solid",fontname="Helvetica"];
  Node24 [label="AVSCommon/SDKInterfaces\l/DirectiveHandlerInterface.h",height=0.2,width=0.4,color="red", fillcolor="white", style="filled",URL="$_directive_handler_interface_8h.html"];
  Node24 -> Node2 [color="midnightblue",fontsize="10",style="solid",fontname="Helvetica"];
  Node24 -> Node7 [color="midnightblue",fontsize="10",style="solid",fontname="Helvetica"];
  Node24 -> Node25 [color="midnightblue",fontsize="10",style="solid",fontname="Helvetica"];
  Node25 [label="AVSCommon/SDKInterfaces\l/DirectiveHandlerResultInterface.h",height=0.2,width=0.4,color="black", fillcolor="white", style="filled",URL="$_directive_handler_result_interface_8h.html"];
  Node25 -> Node2 [color="midnightblue",fontsize="10",style="solid",fontname="Helvetica"];
  Node25 -> Node7 [color="midnightblue",fontsize="10",style="solid",fontname="Helvetica"];
  Node15 -> Node25 [color="midnightblue",fontsize="10",style="solid",fontname="Helvetica"];
  Node1 -> Node26 [color="midnightblue",fontsize="10",style="solid",fontname="Helvetica"];
  Node26 [label="AVSCommon/AVS/Capability\lConfiguration.h",height=0.2,width=0.4,color="black", fillcolor="white", style="filled",URL="$_capability_configuration_8h.html"];
  Node26 -> Node4 [color="midnightblue",fontsize="10",style="solid",fontname="Helvetica"];
  Node26 -> Node17 [color="midnightblue",fontsize="10",style="solid",fontname="Helvetica"];
  Node1 -> Node27 [color="midnightblue",fontsize="10",style="solid",fontname="Helvetica"];
  Node27 [label="AVSCommon/SDKInterfaces\l/CapabilityConfigurationInterface.h",height=0.2,width=0.4,color="black", fillcolor="white", style="filled",URL="$_capability_configuration_interface_8h.html"];
  Node27 -> Node2 [color="midnightblue",fontsize="10",style="solid",fontname="Helvetica"];
  Node27 -> Node5 [color="midnightblue",fontsize="10",style="solid",fontname="Helvetica"];
  Node27 -> Node26 [color="midnightblue",fontsize="10",style="solid",fontname="Helvetica"];
  Node1 -> Node28 [color="midnightblue",fontsize="10",style="solid",fontname="Helvetica"];
  Node28 [label="AVSCommon/AVS/DialogUXState\lAggregator.h",height=0.2,width=0.4,color="black", fillcolor="white", style="filled",URL="$_dialog_u_x_state_aggregator_8h.html"];
  Node28 -> Node16 [color="midnightblue",fontsize="10",style="solid",fontname="Helvetica"];
  Node28 -> Node11 [color="midnightblue",fontsize="10",style="solid",fontname="Helvetica"];
  Node28 -> Node5 [color="midnightblue",fontsize="10",style="solid",fontname="Helvetica"];
  Node28 -> Node29 [color="midnightblue",fontsize="10",style="solid",fontname="Helvetica"];
  Node29 [label="AVSCommon/SDKInterfaces\l/AudioInputProcessorObserver\lInterface.h",height=0.2,width=0.4,color="black", fillcolor="white", style="filled",URL="$_audio_input_processor_observer_interface_8h.html"];
  Node29 -> Node4 [color="midnightblue",fontsize="10",style="solid",fontname="Helvetica"];
  Node28 -> Node30 [color="midnightblue",fontsize="10",style="solid",fontname="Helvetica"];
  Node30 [label="AVSCommon/SDKInterfaces\l/ConnectionStatusObserverInterface.h",height=0.2,width=0.4,color="black", fillcolor="white", style="filled",URL="$_connection_status_observer_interface_8h.html"];
  Node30 -> Node8 [color="midnightblue",fontsize="10",style="solid",fontname="Helvetica"];
  Node28 -> Node31 [color="midnightblue",fontsize="10",style="solid",fontname="Helvetica"];
  Node31 [label="AVSCommon/SDKInterfaces\l/DialogUXStateObserverInterface.h",height=0.2,width=0.4,color="black", fillcolor="white", style="filled",URL="$_dialog_u_x_state_observer_interface_8h.html"];
  Node31 -> Node13 [color="midnightblue",fontsize="10",style="solid",fontname="Helvetica"];
  Node31 -> Node4 [color="midnightblue",fontsize="10",style="solid",fontname="Helvetica"];
  Node28 -> Node32 [color="midnightblue",fontsize="10",style="solid",fontname="Helvetica"];
  Node32 [label="AVSCommon/SDKInterfaces\l/MessageObserverInterface.h",height=0.2,width=0.4,color="black", fillcolor="white", style="filled",URL="$_message_observer_interface_8h.html"];
  Node32 -> Node4 [color="midnightblue",fontsize="10",style="solid",fontname="Helvetica"];
  Node28 -> Node33 [color="midnightblue",fontsize="10",style="solid",fontname="Helvetica"];
  Node33 [label="AVSCommon/SDKInterfaces\l/SpeechSynthesizerObserverInterface.h",height=0.2,width=0.4,color="black", fillcolor="white", style="filled",URL="$_speech_synthesizer_observer_interface_8h.html"];
  Node33 -> Node8 [color="midnightblue",fontsize="10",style="solid",fontname="Helvetica"];
  Node28 -> Node34 [color="midnightblue",fontsize="10",style="solid",fontname="Helvetica"];
  Node34 [label="AVSCommon/Utils/Threading\l/Executor.h",height=0.2,width=0.4,color="red", fillcolor="white", style="filled",URL="$_executor_8h.html"];
  Node34 -> Node16 [color="midnightblue",fontsize="10",style="solid",fontname="Helvetica"];
  Node34 -> Node11 [color="midnightblue",fontsize="10",style="solid",fontname="Helvetica"];
  Node34 -> Node6 [color="midnightblue",fontsize="10",style="solid",fontname="Helvetica"];
  Node34 -> Node35 [color="midnightblue",fontsize="10",style="solid",fontname="Helvetica"];
  Node35 [label="future",height=0.2,width=0.4,color="grey75", fillcolor="white", style="filled"];
  Node34 -> Node2 [color="midnightblue",fontsize="10",style="solid",fontname="Helvetica"];
  Node34 -> Node3 [color="midnightblue",fontsize="10",style="solid",fontname="Helvetica"];
  Node34 -> Node9 [color="midnightblue",fontsize="10",style="solid",fontname="Helvetica"];
  Node28 -> Node36 [color="midnightblue",fontsize="10",style="solid",fontname="Helvetica"];
  Node36 [label="AVSCommon/Utils/Timing\l/Timer.h",height=0.2,width=0.4,color="red", fillcolor="white", style="filled",URL="$_a_v_s_common_2_utils_2include_2_a_v_s_common_2_utils_2_timing_2_timer_8h.html"];
  Node36 -> Node11 [color="midnightblue",fontsize="10",style="solid",fontname="Helvetica"];
  Node36 -> Node35 [color="midnightblue",fontsize="10",style="solid",fontname="Helvetica"];
  Node36 -> Node3 [color="midnightblue",fontsize="10",style="solid",fontname="Helvetica"];
  Node1 -> Node33 [color="midnightblue",fontsize="10",style="solid",fontname="Helvetica"];
  Node1 -> Node19 [color="midnightblue",fontsize="10",style="solid",fontname="Helvetica"];
  Node1 -> Node37 [color="midnightblue",fontsize="10",style="solid",fontname="Helvetica"];
  Node37 [label="AVSCommon/SDKInterfaces\l/ContextManagerInterface.h",height=0.2,width=0.4,color="black", fillcolor="white", style="filled",URL="$_context_manager_interface_8h.html"];
  Node37 -> Node2 [color="midnightblue",fontsize="10",style="solid",fontname="Helvetica"];
  Node37 -> Node22 [color="midnightblue",fontsize="10",style="solid",fontname="Helvetica"];
  Node37 -> Node23 [color="midnightblue",fontsize="10",style="solid",fontname="Helvetica"];
  Node37 -> Node38 [color="midnightblue",fontsize="10",style="solid",fontname="Helvetica"];
  Node38 [label="AVSCommon/AVS/StateRefresh\lPolicy.h",height=0.2,width=0.4,color="black", fillcolor="white", style="filled",URL="$_state_refresh_policy_8h.html"];
  Node37 -> Node18 [color="midnightblue",fontsize="10",style="solid",fontname="Helvetica"];
  Node1 -> Node39 [color="midnightblue",fontsize="10",style="solid",fontname="Helvetica"];
  Node39 [label="AVSCommon/SDKInterfaces\l/DirectiveSequencerInterface.h",height=0.2,width=0.4,color="black", fillcolor="white", style="filled",URL="$_directive_sequencer_interface_8h.html"];
  Node39 -> Node2 [color="midnightblue",fontsize="10",style="solid",fontname="Helvetica"];
  Node39 -> Node4 [color="midnightblue",fontsize="10",style="solid",fontname="Helvetica"];
  Node39 -> Node7 [color="midnightblue",fontsize="10",style="solid",fontname="Helvetica"];
  Node39 -> Node24 [color="midnightblue",fontsize="10",style="solid",fontname="Helvetica"];
  Node39 -> Node40 [color="midnightblue",fontsize="10",style="solid",fontname="Helvetica"];
  Node40 [label="AVSCommon/Utils/Requires\lShutdown.h",height=0.2,width=0.4,color="black", fillcolor="white", style="filled",URL="$_requires_shutdown_8h.html"];
  Node40 -> Node16 [color="midnightblue",fontsize="10",style="solid",fontname="Helvetica"];
  Node40 -> Node2 [color="midnightblue",fontsize="10",style="solid",fontname="Helvetica"];
  Node40 -> Node3 [color="midnightblue",fontsize="10",style="solid",fontname="Helvetica"];
  Node40 -> Node4 [color="midnightblue",fontsize="10",style="solid",fontname="Helvetica"];
  Node1 -> Node41 [color="midnightblue",fontsize="10",style="solid",fontname="Helvetica"];
  Node41 [label="AVSCommon/SDKInterfaces\l/FocusManagerInterface.h",height=0.2,width=0.4,color="black", fillcolor="white", style="filled",URL="$_focus_manager_interface_8h.html"];
  Node41 -> Node35 [color="midnightblue",fontsize="10",style="solid",fontname="Helvetica"];
  Node41 -> Node2 [color="midnightblue",fontsize="10",style="solid",fontname="Helvetica"];
  Node41 -> Node4 [color="midnightblue",fontsize="10",style="solid",fontname="Helvetica"];
  Node41 -> Node21 [color="midnightblue",fontsize="10",style="solid",fontname="Helvetica"];
  Node41 -> Node42 [color="midnightblue",fontsize="10",style="solid",fontname="Helvetica"];
  Node42 [label="FocusManagerObserverInterface.h",height=0.2,width=0.4,color="red", fillcolor="white", style="filled",URL="$_focus_manager_observer_interface_8h.html"];
  Node1 -> Node31 [color="midnightblue",fontsize="10",style="solid",fontname="Helvetica"];
  Node1 -> Node43 [color="midnightblue",fontsize="10",style="solid",fontname="Helvetica"];
  Node43 [label="AVSCommon/SDKInterfaces\l/MessageSenderInterface.h",height=0.2,width=0.4,color="black", fillcolor="white", style="filled",URL="$_message_sender_interface_8h.html"];
  Node43 -> Node44 [color="midnightblue",fontsize="10",style="solid",fontname="Helvetica"];
  Node44 [label="AVSCommon/AVS/MessageRequest.h",height=0.2,width=0.4,color="red", fillcolor="white", style="filled",URL="$_message_request_8h.html"];
  Node44 -> Node2 [color="midnightblue",fontsize="10",style="solid",fontname="Helvetica"];
  Node44 -> Node3 [color="midnightblue",fontsize="10",style="solid",fontname="Helvetica"];
  Node44 -> Node4 [color="midnightblue",fontsize="10",style="solid",fontname="Helvetica"];
  Node44 -> Node5 [color="midnightblue",fontsize="10",style="solid",fontname="Helvetica"];
  Node44 -> Node45 [color="midnightblue",fontsize="10",style="solid",fontname="Helvetica"];
  Node45 [label="vector",height=0.2,width=0.4,color="grey75", fillcolor="white", style="filled"];
  Node44 -> Node12 [color="midnightblue",fontsize="10",style="solid",fontname="Helvetica"];
  Node1 -> Node46 [color="midnightblue",fontsize="10",style="solid",fontname="Helvetica"];
  Node46 [label="AVSCommon/Utils/MediaPlayer\l/MediaPlayerInterface.h",height=0.2,width=0.4,color="black", fillcolor="white", style="filled",URL="$_media_player_interface_8h.html"];
  Node46 -> Node11 [color="midnightblue",fontsize="10",style="solid",fontname="Helvetica"];
  Node46 -> Node47 [color="midnightblue",fontsize="10",style="solid",fontname="Helvetica"];
  Node47 [label="cstdint",height=0.2,width=0.4,color="grey75", fillcolor="white", style="filled"];
  Node46 -> Node35 [color="midnightblue",fontsize="10",style="solid",fontname="Helvetica"];
  Node46 -> Node2 [color="midnightblue",fontsize="10",style="solid",fontname="Helvetica"];
  Node46 -> Node12 [color="midnightblue",fontsize="10",style="solid",fontname="Helvetica"];
  Node46 -> Node48 [color="midnightblue",fontsize="10",style="solid",fontname="Helvetica"];
  Node48 [label="AVSCommon/Utils/AudioFormat.h",height=0.2,width=0.4,color="black", fillcolor="white", style="filled",URL="$_audio_format_8h.html"];
  Node48 -> Node13 [color="midnightblue",fontsize="10",style="solid",fontname="Helvetica"];
  Node1 -> Node49 [color="midnightblue",fontsize="10",style="solid",fontname="Helvetica"];
  Node49 [label="AVSCommon/Utils/MediaPlayer\l/MediaPlayerObserverInterface.h",height=0.2,width=0.4,color="black", fillcolor="white", style="filled",URL="$_media_player_observer_interface_8h.html"];
  Node49 -> Node4 [color="midnightblue",fontsize="10",style="solid",fontname="Helvetica"];
  Node49 -> Node45 [color="midnightblue",fontsize="10",style="solid",fontname="Helvetica"];
  Node49 -> Node2 [color="midnightblue",fontsize="10",style="solid",fontname="Helvetica"];
  Node49 -> Node50 [color="midnightblue",fontsize="10",style="solid",fontname="Helvetica"];
  Node50 [label="AVSCommon/Utils/MediaPlayer\l/ErrorTypes.h",height=0.2,width=0.4,color="black", fillcolor="white", style="filled",URL="$_error_types_8h.html"];
  Node50 -> Node13 [color="midnightblue",fontsize="10",style="solid",fontname="Helvetica"];
  Node49 -> Node46 [color="midnightblue",fontsize="10",style="solid",fontname="Helvetica"];
  Node1 -> Node40 [color="midnightblue",fontsize="10",style="solid",fontname="Helvetica"];
  Node1 -> Node34 [color="midnightblue",fontsize="10",style="solid",fontname="Helvetica"];
}
