digraph "alexaClientSDK::avsCommon::sdkInterfaces::StateSynchronizerObserverInterface"
{
  edge [fontname="Helvetica",fontsize="10",labelfontname="Helvetica",labelfontsize="10"];
  node [fontname="Helvetica",fontsize="10",shape=record];
  Node1 [label="alexaClientSDK::avsCommon\l::sdkInterfaces::StateSynchronizer\lObserverInterface",height=0.2,width=0.4,color="black", fillcolor="grey75", style="filled", fontcolor="black"];
  Node1 -> Node2 [dir="back",color="midnightblue",fontsize="10",style="solid",fontname="Helvetica"];
  Node2 [label="alexaClientSDK::avsCommon\l::sdkInterfaces::test::\lMockStateSynchronizerObserver",height=0.2,width=0.4,color="black", fillcolor="white", style="filled",URL="$classalexa_client_s_d_k_1_1avs_common_1_1sdk_interfaces_1_1test_1_1_mock_state_synchronizer_observer.html"];
}
