digraph "/workplace/avs-device-sdk/CapabilitiesDelegate/test/Common" {
  compound=true
  node [ fontsize="10", fontname="Helvetica"];
  edge [ labelfontsize="10", labelfontname="Helvetica"];
  subgraph clusterdir_28647357adb2301cd82a75786fa679b0 {
    graph [ bgcolor="#ddddee", pencolor="black", label="test" fontname="Helvetica", fontsize="10", URL="dir_28647357adb2301cd82a75786fa679b0.html"]
  dir_c927bc092838eb64bdabb961a4b64f06 [shape=box, label="Common", style="filled", fillcolor="#eeeeff", pencolor="black", URL="dir_c927bc092838eb64bdabb961a4b64f06.html"];
  }
  dir_13e65effb2bde530b17b3d5eefcd0266 [shape=box label="AVSCommon" fillcolor="white" style="filled" color="red" URL="dir_13e65effb2bde530b17b3d5eefcd0266.html"];
  dir_c927bc092838eb64bdabb961a4b64f06->dir_13e65effb2bde530b17b3d5eefcd0266 [headlabel="9", labeldistance=1.5 headhref="dir_000131_000015.html"];
}
