digraph "/workplace/avs-device-sdk/AVSCommon/AVS/include/AVSCommon/AVS/DirectiveHandlerConfiguration.h"
{
  edge [fontname="Helvetica",fontsize="10",labelfontname="Helvetica",labelfontsize="10"];
  node [fontname="Helvetica",fontsize="10",shape=record];
  Node1 [label="/workplace/avs-device\l-sdk/AVSCommon/AVS/include\l/AVSCommon/AVS/DirectiveHandlerConfiguration.h",height=0.2,width=0.4,color="black", fillcolor="grey75", style="filled", fontcolor="black"];
  Node1 -> Node2 [dir="back",color="midnightblue",fontsize="10",style="solid",fontname="Helvetica"];
  Node2 [label="/workplace/avs-device\l-sdk/ADSL/include/ADSL\l/DirectiveRouter.h",height=0.2,width=0.4,color="black", fillcolor="white", style="filled",URL="$_directive_router_8h.html"];
  Node2 -> Node3 [dir="back",color="midnightblue",fontsize="10",style="solid",fontname="Helvetica"];
  Node3 [label="/workplace/avs-device\l-sdk/ADSL/include/ADSL\l/DirectiveProcessor.h",height=0.2,width=0.4,color="black", fillcolor="white", style="filled",URL="$_directive_processor_8h.html"];
  Node3 -> Node4 [dir="back",color="midnightblue",fontsize="10",style="solid",fontname="Helvetica"];
  Node4 [label="/workplace/avs-device\l-sdk/ADSL/include/ADSL\l/DirectiveSequencer.h",height=0.2,width=0.4,color="black", fillcolor="white", style="filled",URL="$_directive_sequencer_8h.html"];
  Node4 -> Node5 [dir="back",color="midnightblue",fontsize="10",style="solid",fontname="Helvetica"];
  Node5 [label="/workplace/avs-device\l-sdk/ADSL/src/DirectiveSequencer.cpp",height=0.2,width=0.4,color="black", fillcolor="white", style="filled",URL="$_directive_sequencer_8cpp.html"];
  Node4 -> Node6 [dir="back",color="midnightblue",fontsize="10",style="solid",fontname="Helvetica"];
  Node6 [label="/workplace/avs-device\l-sdk/ADSL/test/DirectiveSequencer\lTest.cpp",height=0.2,width=0.4,color="black", fillcolor="white", style="filled",URL="$_directive_sequencer_test_8cpp.html"];
  Node4 -> Node7 [dir="back",color="midnightblue",fontsize="10",style="solid",fontname="Helvetica"];
  Node7 [label="/workplace/avs-device\l-sdk/ADSL/test/MessageInterpreter\lTest.cpp",height=0.2,width=0.4,color="black", fillcolor="white", style="filled",URL="$_message_interpreter_test_8cpp.html"];
  Node4 -> Node8 [dir="back",color="midnightblue",fontsize="10",style="solid",fontname="Helvetica"];
  Node8 [label="/workplace/avs-device\l-sdk/ApplicationUtilities\l/DefaultClient/include/DefaultClient\l/DefaultClient.h",height=0.2,width=0.4,color="red", fillcolor="white", style="filled",URL="$_default_client_8h.html"];
  Node4 -> Node9 [dir="back",color="midnightblue",fontsize="10",style="solid",fontname="Helvetica"];
  Node9 [label="/workplace/avs-device\l-sdk/CapabilityAgents\l/System/a4btest/RevokeAuthorization\lHandlerTest.cpp",height=0.2,width=0.4,color="black", fillcolor="white", style="filled",URL="$_revoke_authorization_handler_test_8cpp.html"];
  Node4 -> Node10 [dir="back",color="midnightblue",fontsize="10",style="solid",fontname="Helvetica"];
  Node10 [label="/workplace/avs-device\l-sdk/CapabilityAgents\l/System/test/EndpointHandler\lTest.cpp",height=0.2,width=0.4,color="black", fillcolor="white", style="filled",URL="$_endpoint_handler_test_8cpp.html"];
  Node4 -> Node11 [dir="back",color="midnightblue",fontsize="10",style="solid",fontname="Helvetica"];
  Node11 [label="/workplace/avs-device\l-sdk/CapabilityAgents\l/System/test/UserInactivityMonitor\lTest.cpp",height=0.2,width=0.4,color="black", fillcolor="white", style="filled",URL="$_user_inactivity_monitor_test_8cpp.html"];
  Node4 -> Node12 [dir="back",color="midnightblue",fontsize="10",style="solid",fontname="Helvetica"];
  Node12 [label="/workplace/avs-device\l-sdk/Integration/test\l/AlertsIntegrationTest.cpp",height=0.2,width=0.4,color="black", fillcolor="white", style="filled",URL="$_alerts_integration_test_8cpp.html"];
  Node4 -> Node13 [dir="back",color="midnightblue",fontsize="10",style="solid",fontname="Helvetica"];
  Node13 [label="/workplace/avs-device\l-sdk/Integration/test\l/AlexaDirectiveSequencerLibrary\lTest.cpp",height=0.2,width=0.4,color="black", fillcolor="white", style="filled",URL="$_alexa_directive_sequencer_library_test_8cpp.html"];
  Node4 -> Node14 [dir="back",color="midnightblue",fontsize="10",style="solid",fontname="Helvetica"];
  Node14 [label="/workplace/avs-device\l-sdk/Integration/test\l/AudioInputProcessorIntegration\lTest.cpp",height=0.2,width=0.4,color="black", fillcolor="white", style="filled",URL="$_audio_input_processor_integration_test_8cpp.html"];
  Node4 -> Node15 [dir="back",color="midnightblue",fontsize="10",style="solid",fontname="Helvetica"];
  Node15 [label="/workplace/avs-device\l-sdk/Integration/test\l/AudioPlayerIntegrationTest.cpp",height=0.2,width=0.4,color="black", fillcolor="white", style="filled",URL="$_audio_player_integration_test_8cpp.html"];
  Node4 -> Node16 [dir="back",color="midnightblue",fontsize="10",style="solid",fontname="Helvetica"];
  Node16 [label="/workplace/avs-device\l-sdk/Integration/test\l/SpeechSynthesizerIntegration\lTest.cpp",height=0.2,width=0.4,color="black", fillcolor="white", style="filled",URL="$_speech_synthesizer_integration_test_8cpp.html"];
  Node3 -> Node17 [dir="back",color="midnightblue",fontsize="10",style="solid",fontname="Helvetica"];
  Node17 [label="/workplace/avs-device\l-sdk/ADSL/src/DirectiveProcessor.cpp",height=0.2,width=0.4,color="black", fillcolor="white", style="filled",URL="$_directive_processor_8cpp.html"];
  Node3 -> Node18 [dir="back",color="midnightblue",fontsize="10",style="solid",fontname="Helvetica"];
  Node18 [label="/workplace/avs-device\l-sdk/ADSL/test/DirectiveProcessor\lTest.cpp",height=0.2,width=0.4,color="black", fillcolor="white", style="filled",URL="$_directive_processor_test_8cpp.html"];
  Node2 -> Node4 [dir="back",color="midnightblue",fontsize="10",style="solid",fontname="Helvetica"];
  Node2 -> Node19 [dir="back",color="midnightblue",fontsize="10",style="solid",fontname="Helvetica"];
  Node19 [label="/workplace/avs-device\l-sdk/ADSL/src/DirectiveRouter.cpp",height=0.2,width=0.4,color="black", fillcolor="white", style="filled",URL="$_directive_router_8cpp.html"];
  Node2 -> Node20 [dir="back",color="midnightblue",fontsize="10",style="solid",fontname="Helvetica"];
  Node20 [label="/workplace/avs-device\l-sdk/ADSL/test/DirectiveRouter\lTest.cpp",height=0.2,width=0.4,color="black", fillcolor="white", style="filled",URL="$_directive_router_test_8cpp.html"];
  Node1 -> Node21 [dir="back",color="midnightblue",fontsize="10",style="solid",fontname="Helvetica"];
  Node21 [label="/workplace/avs-device\l-sdk/AVSCommon/SDKInterfaces\l/include/AVSCommon/SDKInterfaces\l/DirectiveHandlerInterface.h",height=0.2,width=0.4,color="black", fillcolor="white", style="filled",URL="$_directive_handler_interface_8h.html"];
  Node21 -> Node3 [dir="back",color="midnightblue",fontsize="10",style="solid",fontname="Helvetica"];
  Node21 -> Node22 [dir="back",color="midnightblue",fontsize="10",style="solid",fontname="Helvetica"];
  Node22 [label="/workplace/avs-device\l-sdk/ADSL/test/common\l/MockDirectiveHandler.h",height=0.2,width=0.4,color="black", fillcolor="white", style="filled",URL="$_mock_directive_handler_8h.html"];
  Node22 -> Node23 [dir="back",color="midnightblue",fontsize="10",style="solid",fontname="Helvetica"];
  Node23 [label="/workplace/avs-device\l-sdk/ADSL/test/common\l/MockDirectiveHandler.cpp",height=0.2,width=0.4,color="black", fillcolor="white", style="filled",URL="$_mock_directive_handler_8cpp.html"];
  Node22 -> Node18 [dir="back",color="midnightblue",fontsize="10",style="solid",fontname="Helvetica"];
  Node22 -> Node20 [dir="back",color="midnightblue",fontsize="10",style="solid",fontname="Helvetica"];
  Node22 -> Node6 [dir="back",color="midnightblue",fontsize="10",style="solid",fontname="Helvetica"];
  Node21 -> Node24 [dir="back",color="midnightblue",fontsize="10",style="solid",fontname="Helvetica"];
  Node24 [label="/workplace/avs-device\l-sdk/AVSCommon/AVS/include\l/AVSCommon/AVS/CapabilityAgent.h",height=0.2,width=0.4,color="red", fillcolor="white", style="filled",URL="$_capability_agent_8h.html"];
  Node24 -> Node25 [dir="back",color="midnightblue",fontsize="10",style="solid",fontname="Helvetica"];
  Node25 [label="/workplace/avs-device\l-sdk/AVSCommon/AVS/src\l/CapabilityAgent.cpp",height=0.2,width=0.4,color="black", fillcolor="white", style="filled",URL="$_capability_agent_8cpp.html"];
  Node24 -> Node26 [dir="back",color="midnightblue",fontsize="10",style="solid",fontname="Helvetica"];
  Node26 [label="/workplace/avs-device\l-sdk/AVSCommon/AVS/test\l/CapabilityAgentTest.cpp",height=0.2,width=0.4,color="black", fillcolor="white", style="filled",URL="$_capability_agent_test_8cpp.html"];
  Node24 -> Node27 [dir="back",color="midnightblue",fontsize="10",style="solid",fontname="Helvetica"];
  Node27 [label="/workplace/avs-device\l-sdk/CapabilityAgents\l/AIP/include/AIP/AudioInputProcessor.h",height=0.2,width=0.4,color="black", fillcolor="white", style="filled",URL="$_audio_input_processor_8h.html"];
  Node27 -> Node8 [dir="back",color="midnightblue",fontsize="10",style="solid",fontname="Helvetica"];
  Node27 -> Node28 [dir="back",color="midnightblue",fontsize="10",style="solid",fontname="Helvetica"];
  Node28 [label="/workplace/avs-device\l-sdk/CapabilityAgents\l/AIP/src/AudioInputProcessor.cpp",height=0.2,width=0.4,color="black", fillcolor="white", style="filled",URL="$_audio_input_processor_8cpp.html"];
  Node27 -> Node29 [dir="back",color="midnightblue",fontsize="10",style="solid",fontname="Helvetica"];
  Node29 [label="/workplace/avs-device\l-sdk/CapabilityAgents\l/AIP/test/AudioInputProcessor\lTest.cpp",height=0.2,width=0.4,color="black", fillcolor="white", style="filled",URL="$_audio_input_processor_test_8cpp.html"];
  Node27 -> Node12 [dir="back",color="midnightblue",fontsize="10",style="solid",fontname="Helvetica"];
  Node27 -> Node14 [dir="back",color="midnightblue",fontsize="10",style="solid",fontname="Helvetica"];
  Node27 -> Node15 [dir="back",color="midnightblue",fontsize="10",style="solid",fontname="Helvetica"];
  Node24 -> Node30 [dir="back",color="midnightblue",fontsize="10",style="solid",fontname="Helvetica"];
  Node30 [label="/workplace/avs-device\l-sdk/CapabilityAgents\l/Alerts/include/Alerts\l/AlertsCapabilityAgent.h",height=0.2,width=0.4,color="red", fillcolor="white", style="filled",URL="$_alerts_capability_agent_8h.html"];
  Node30 -> Node8 [dir="back",color="midnightblue",fontsize="10",style="solid",fontname="Helvetica"];
  Node30 -> Node12 [dir="back",color="midnightblue",fontsize="10",style="solid",fontname="Helvetica"];
  Node24 -> Node31 [dir="back",color="midnightblue",fontsize="10",style="solid",fontname="Helvetica"];
  Node31 [label="/workplace/avs-device\l-sdk/CapabilityAgents\l/AudioPlayer/include/AudioPlayer\l/AudioPlayer.h",height=0.2,width=0.4,color="red", fillcolor="white", style="filled",URL="$_audio_player_8h.html"];
  Node31 -> Node8 [dir="back",color="midnightblue",fontsize="10",style="solid",fontname="Helvetica"];
  Node31 -> Node15 [dir="back",color="midnightblue",fontsize="10",style="solid",fontname="Helvetica"];
  Node24 -> Node32 [dir="back",color="midnightblue",fontsize="10",style="solid",fontname="Helvetica"];
  Node32 [label="/workplace/avs-device\l-sdk/CapabilityAgents\l/Bluetooth/include/Bluetooth\l/Bluetooth.h",height=0.2,width=0.4,color="red", fillcolor="white", style="filled",URL="$_bluetooth_8h.html"];
  Node32 -> Node8 [dir="back",color="midnightblue",fontsize="10",style="solid",fontname="Helvetica"];
  Node24 -> Node33 [dir="back",color="midnightblue",fontsize="10",style="solid",fontname="Helvetica"];
  Node33 [label="/workplace/avs-device\l-sdk/CapabilityAgents\l/DoNotDisturb/include\l/DoNotDisturbCA/DoNotDisturbCapability\lAgent.h",height=0.2,width=0.4,color="red", fillcolor="white", style="filled",URL="$_do_not_disturb_capability_agent_8h.html"];
  Node33 -> Node8 [dir="back",color="midnightblue",fontsize="10",style="solid",fontname="Helvetica"];
  Node24 -> Node34 [dir="back",color="midnightblue",fontsize="10",style="solid",fontname="Helvetica"];
  Node34 [label="/workplace/avs-device\l-sdk/CapabilityAgents\l/Equalizer/include/Equalizer\l/EqualizerCapabilityAgent.h",height=0.2,width=0.4,color="red", fillcolor="white", style="filled",URL="$_equalizer_capability_agent_8h.html"];
  Node34 -> Node8 [dir="back",color="midnightblue",fontsize="10",style="solid",fontname="Helvetica"];
  Node24 -> Node35 [dir="back",color="midnightblue",fontsize="10",style="solid",fontname="Helvetica"];
  Node35 [label="/workplace/avs-device\l-sdk/CapabilityAgents\l/ExternalMediaPlayer/include\l/ExternalMediaPlayer/ExternalMedia\lPlayer.h",height=0.2,width=0.4,color="black", fillcolor="white", style="filled",URL="$_external_media_player_8h.html"];
  Node35 -> Node8 [dir="back",color="midnightblue",fontsize="10",style="solid",fontname="Helvetica"];
  Node35 -> Node36 [dir="back",color="midnightblue",fontsize="10",style="solid",fontname="Helvetica"];
  Node36 [label="/workplace/avs-device\l-sdk/CapabilityAgents\l/ExternalMediaPlayer/src\l/ExternalMediaPlayer.cpp",height=0.2,width=0.4,color="black", fillcolor="white", style="filled",URL="$_external_media_player_8cpp.html"];
  Node35 -> Node37 [dir="back",color="midnightblue",fontsize="10",style="solid",fontname="Helvetica"];
  Node37 [label="/workplace/avs-device\l-sdk/CapabilityAgents\l/ExternalMediaPlayer/test\l/ExternalMediaPlayerTest.cpp",height=0.2,width=0.4,color="black", fillcolor="white", style="filled",URL="$_external_media_player_test_8cpp.html"];
  Node35 -> Node38 [dir="back",color="midnightblue",fontsize="10",style="solid",fontname="Helvetica"];
  Node38 [label="/workplace/avs-device\l-sdk/SampleApp/include\l/SampleApp/SampleApplication.h",height=0.2,width=0.4,color="red", fillcolor="white", style="filled",URL="$_sample_application_8h.html"];
  Node24 -> Node39 [dir="back",color="midnightblue",fontsize="10",style="solid",fontname="Helvetica"];
  Node39 [label="/workplace/avs-device\l-sdk/CapabilityAgents\l/InteractionModel/include\l/InteractionModel/InteractionModel\lCapabilityAgent.h",height=0.2,width=0.4,color="red", fillcolor="white", style="filled",URL="$_interaction_model_capability_agent_8h.html"];
  Node39 -> Node8 [dir="back",color="midnightblue",fontsize="10",style="solid",fontname="Helvetica"];
  Node24 -> Node40 [dir="back",color="midnightblue",fontsize="10",style="solid",fontname="Helvetica"];
  Node40 [label="/workplace/avs-device\l-sdk/CapabilityAgents\l/MRM/include/MRM/MRMCapability\lAgent.h",height=0.2,width=0.4,color="red", fillcolor="white", style="filled",URL="$_m_r_m_capability_agent_8h.html"];
  Node40 -> Node8 [dir="back",color="midnightblue",fontsize="10",style="solid",fontname="Helvetica"];
  Node24 -> Node41 [dir="back",color="midnightblue",fontsize="10",style="solid",fontname="Helvetica"];
  Node41 [label="/workplace/avs-device\l-sdk/CapabilityAgents\l/Notifications/include\l/Notifications/NotificationsCapability\lAgent.h",height=0.2,width=0.4,color="red", fillcolor="white", style="filled",URL="$_notifications_capability_agent_8h.html"];
  Node41 -> Node8 [dir="back",color="midnightblue",fontsize="10",style="solid",fontname="Helvetica"];
  Node24 -> Node42 [dir="back",color="midnightblue",fontsize="10",style="solid",fontname="Helvetica"];
  Node42 [label="/workplace/avs-device\l-sdk/CapabilityAgents\l/SpeakerManager/include\l/SpeakerManager/SpeakerManager.h",height=0.2,width=0.4,color="red", fillcolor="white", style="filled",URL="$_speaker_manager_8h.html"];
  Node42 -> Node8 [dir="back",color="midnightblue",fontsize="10",style="solid",fontname="Helvetica"];
  Node24 -> Node43 [dir="back",color="midnightblue",fontsize="10",style="solid",fontname="Helvetica"];
  Node43 [label="/workplace/avs-device\l-sdk/CapabilityAgents\l/SpeechSynthesizer/include\l/SpeechSynthesizer/SpeechSynthesizer.h",height=0.2,width=0.4,color="red", fillcolor="white", style="filled",URL="$_speech_synthesizer_8h.html"];
  Node43 -> Node8 [dir="back",color="midnightblue",fontsize="10",style="solid",fontname="Helvetica"];
  Node43 -> Node12 [dir="back",color="midnightblue",fontsize="10",style="solid",fontname="Helvetica"];
  Node43 -> Node15 [dir="back",color="midnightblue",fontsize="10",style="solid",fontname="Helvetica"];
  Node43 -> Node16 [dir="back",color="midnightblue",fontsize="10",style="solid",fontname="Helvetica"];
  Node24 -> Node44 [dir="back",color="midnightblue",fontsize="10",style="solid",fontname="Helvetica"];
  Node44 [label="/workplace/avs-device\l-sdk/CapabilityAgents\l/System/include/System\l/EndpointHandler.h",height=0.2,width=0.4,color="red", fillcolor="white", style="filled",URL="$_endpoint_handler_8h.html"];
  Node44 -> Node10 [dir="back",color="midnightblue",fontsize="10",style="solid",fontname="Helvetica"];
  Node24 -> Node45 [dir="back",color="midnightblue",fontsize="10",style="solid",fontname="Helvetica"];
  Node45 [label="/workplace/avs-device\l-sdk/CapabilityAgents\l/System/include/System\l/RevokeAuthorizationHandler.h",height=0.2,width=0.4,color="red", fillcolor="white", style="filled",URL="$_revoke_authorization_handler_8h.html"];
  Node45 -> Node9 [dir="back",color="midnightblue",fontsize="10",style="solid",fontname="Helvetica"];
  Node21 -> Node46 [dir="back",color="midnightblue",fontsize="10",style="solid",fontname="Helvetica"];
  Node46 [label="/workplace/avs-device\l-sdk/AVSCommon/AVS/include\l/AVSCommon/AVS/HandlerAndPolicy.h",height=0.2,width=0.4,color="red", fillcolor="white", style="filled",URL="$_handler_and_policy_8h.html"];
  Node46 -> Node2 [dir="back",color="midnightblue",fontsize="10",style="solid",fontname="Helvetica"];
  Node46 -> Node47 [dir="back",color="midnightblue",fontsize="10",style="solid",fontname="Helvetica"];
  Node47 [label="/workplace/avs-device\l-sdk/AVSCommon/AVS/test\l/HandlerAndPolicyTest.cpp",height=0.2,width=0.4,color="black", fillcolor="white", style="filled",URL="$_handler_and_policy_test_8cpp.html"];
  Node21 -> Node47 [dir="back",color="midnightblue",fontsize="10",style="solid",fontname="Helvetica"];
  Node21 -> Node48 [dir="back",color="midnightblue",fontsize="10",style="solid",fontname="Helvetica"];
  Node48 [label="/workplace/avs-device\l-sdk/AVSCommon/SDKInterfaces\l/include/AVSCommon/SDKInterfaces\l/DirectiveSequencerInterface.h",height=0.2,width=0.4,color="red", fillcolor="white", style="filled",URL="$_directive_sequencer_interface_8h.html"];
  Node48 -> Node4 [dir="back",color="midnightblue",fontsize="10",style="solid",fontname="Helvetica"];
  Node48 -> Node27 [dir="back",color="midnightblue",fontsize="10",style="solid",fontname="Helvetica"];
  Node48 -> Node39 [dir="back",color="midnightblue",fontsize="10",style="solid",fontname="Helvetica"];
  Node48 -> Node40 [dir="back",color="midnightblue",fontsize="10",style="solid",fontname="Helvetica"];
  Node48 -> Node43 [dir="back",color="midnightblue",fontsize="10",style="solid",fontname="Helvetica"];
  Node21 -> Node49 [dir="back",color="midnightblue",fontsize="10",style="solid",fontname="Helvetica"];
  Node49 [label="/workplace/avs-device\l-sdk/Integration/include\l/Integration/TestDirectiveHandler.h",height=0.2,width=0.4,color="red", fillcolor="white", style="filled",URL="$_test_directive_handler_8h.html"];
  Node49 -> Node12 [dir="back",color="midnightblue",fontsize="10",style="solid",fontname="Helvetica"];
  Node49 -> Node13 [dir="back",color="midnightblue",fontsize="10",style="solid",fontname="Helvetica"];
  Node49 -> Node14 [dir="back",color="midnightblue",fontsize="10",style="solid",fontname="Helvetica"];
  Node49 -> Node15 [dir="back",color="midnightblue",fontsize="10",style="solid",fontname="Helvetica"];
  Node49 -> Node16 [dir="back",color="midnightblue",fontsize="10",style="solid",fontname="Helvetica"];
  Node21 -> Node50 [dir="back",color="midnightblue",fontsize="10",style="solid",fontname="Helvetica"];
  Node50 [label="/workplace/avs-device\l-sdk/Integration/include\l/Integration/TestExceptionEncountered\lSender.h",height=0.2,width=0.4,color="red", fillcolor="white", style="filled",URL="$_test_exception_encountered_sender_8h.html"];
  Node50 -> Node12 [dir="back",color="midnightblue",fontsize="10",style="solid",fontname="Helvetica"];
  Node50 -> Node13 [dir="back",color="midnightblue",fontsize="10",style="solid",fontname="Helvetica"];
  Node50 -> Node14 [dir="back",color="midnightblue",fontsize="10",style="solid",fontname="Helvetica"];
  Node50 -> Node15 [dir="back",color="midnightblue",fontsize="10",style="solid",fontname="Helvetica"];
  Node50 -> Node16 [dir="back",color="midnightblue",fontsize="10",style="solid",fontname="Helvetica"];
  Node21 -> Node12 [dir="back",color="midnightblue",fontsize="10",style="solid",fontname="Helvetica"];
  Node21 -> Node13 [dir="back",color="midnightblue",fontsize="10",style="solid",fontname="Helvetica"];
  Node21 -> Node14 [dir="back",color="midnightblue",fontsize="10",style="solid",fontname="Helvetica"];
  Node21 -> Node15 [dir="back",color="midnightblue",fontsize="10",style="solid",fontname="Helvetica"];
  Node21 -> Node16 [dir="back",color="midnightblue",fontsize="10",style="solid",fontname="Helvetica"];
  Node1 -> Node27 [dir="back",color="midnightblue",fontsize="10",style="solid",fontname="Helvetica"];
  Node1 -> Node35 [dir="back",color="midnightblue",fontsize="10",style="solid",fontname="Helvetica"];
}
