digraph "/workplace/avs-device-sdk/AVSCommon/AVS/src/Attachment" {
  compound=true
  node [ fontsize="10", fontname="Helvetica"];
  edge [ labelfontsize="10", labelfontname="Helvetica"];
  subgraph clusterdir_d94cc11696d13ea67fe90a2d6eb692db {
    graph [ bgcolor="#ddddee", pencolor="black", label="src" fontname="Helvetica", fontsize="10", URL="dir_d94cc11696d13ea67fe90a2d6eb692db.html"]
  dir_06e279b227c8231beccd25579f494998 [shape=box, label="Attachment", style="filled", fillcolor="#eeeeff", pencolor="black", URL="dir_06e279b227c8231beccd25579f494998.html"];
  }
  dir_49dd3d9ac5586189aa170bac46425b9c [shape=box label="Utils" fillcolor="white" style="filled" color="red" URL="dir_49dd3d9ac5586189aa170bac46425b9c.html"];
  dir_a8d3deb3c1282038af9ce4454694c1e1 [shape=box label="include" fillcolor="white" style="filled" color="red" URL="dir_a8d3deb3c1282038af9ce4454694c1e1.html"];
  dir_49dd3d9ac5586189aa170bac46425b9c->dir_a8d3deb3c1282038af9ce4454694c1e1 [headlabel="10", labeldistance=1.5 headhref="dir_000061_000044.html"];
  dir_a8d3deb3c1282038af9ce4454694c1e1->dir_49dd3d9ac5586189aa170bac46425b9c [headlabel="14", labeldistance=1.5 headhref="dir_000044_000061.html"];
  dir_06e279b227c8231beccd25579f494998->dir_49dd3d9ac5586189aa170bac46425b9c [headlabel="7", labeldistance=1.5 headhref="dir_000056_000061.html"];
  dir_06e279b227c8231beccd25579f494998->dir_a8d3deb3c1282038af9ce4454694c1e1 [headlabel="8", labeldistance=1.5 headhref="dir_000056_000044.html"];
}
