digraph "/workplace/avs-device-sdk/CertifiedSender/include/CertifiedSender/SQLiteMessageStorage.h"
{
  edge [fontname="Helvetica",fontsize="10",labelfontname="Helvetica",labelfontsize="10"];
  node [fontname="Helvetica",fontsize="10",shape=record];
  Node1 [label="/workplace/avs-device\l-sdk/CertifiedSender\l/include/CertifiedSender\l/SQLiteMessageStorage.h",height=0.2,width=0.4,color="black", fillcolor="grey75", style="filled", fontcolor="black"];
  Node1 -> Node2 [dir="back",color="midnightblue",fontsize="10",style="solid",fontname="Helvetica"];
  Node2 [label="/workplace/avs-device\l-sdk/ApplicationUtilities\l/DefaultClient/include/DefaultClient\l/DefaultClient.h",height=0.2,width=0.4,color="black", fillcolor="white", style="filled",URL="$_default_client_8h.html"];
  Node2 -> Node3 [dir="back",color="midnightblue",fontsize="10",style="solid",fontname="Helvetica"];
  Node3 [label="/workplace/avs-device\l-sdk/ApplicationUtilities\l/DefaultClient/src/DefaultClient.cpp",height=0.2,width=0.4,color="black", fillcolor="white", style="filled",URL="$_default_client_8cpp.html"];
  Node2 -> Node4 [dir="back",color="midnightblue",fontsize="10",style="solid",fontname="Helvetica"];
  Node4 [label="/workplace/avs-device\l-sdk/SampleApp/include\l/SampleApp/InteractionManager.h",height=0.2,width=0.4,color="black", fillcolor="white", style="filled",URL="$_interaction_manager_8h.html"];
  Node4 -> Node5 [dir="back",color="midnightblue",fontsize="10",style="solid",fontname="Helvetica"];
  Node5 [label="/workplace/avs-device\l-sdk/SampleApp/include\l/SampleApp/UserInputManager.h",height=0.2,width=0.4,color="black", fillcolor="white", style="filled",URL="$_user_input_manager_8h.html"];
  Node5 -> Node6 [dir="back",color="midnightblue",fontsize="10",style="solid",fontname="Helvetica"];
  Node6 [label="/workplace/avs-device\l-sdk/SampleApp/include\l/SampleApp/SampleApplication.h",height=0.2,width=0.4,color="black", fillcolor="white", style="filled",URL="$_sample_application_8h.html"];
  Node6 -> Node7 [dir="back",color="midnightblue",fontsize="10",style="solid",fontname="Helvetica"];
  Node7 [label="/workplace/avs-device\l-sdk/SampleApp/src/main.cpp",height=0.2,width=0.4,color="black", fillcolor="white", style="filled",URL="$main_8cpp.html"];
  Node6 -> Node8 [dir="back",color="midnightblue",fontsize="10",style="solid",fontname="Helvetica"];
  Node8 [label="/workplace/avs-device\l-sdk/SampleApp/src/SampleApplication.cpp",height=0.2,width=0.4,color="black", fillcolor="white", style="filled",URL="$_sample_application_8cpp.html"];
  Node5 -> Node9 [dir="back",color="midnightblue",fontsize="10",style="solid",fontname="Helvetica"];
  Node9 [label="/workplace/avs-device\l-sdk/SampleApp/src/UserInput\lManager.cpp",height=0.2,width=0.4,color="black", fillcolor="white", style="filled",URL="$_user_input_manager_8cpp.html"];
  Node4 -> Node10 [dir="back",color="midnightblue",fontsize="10",style="solid",fontname="Helvetica"];
  Node10 [label="/workplace/avs-device\l-sdk/SampleApp/src/Interaction\lManager.cpp",height=0.2,width=0.4,color="black", fillcolor="white", style="filled",URL="$_interaction_manager_8cpp.html"];
  Node2 -> Node11 [dir="back",color="midnightblue",fontsize="10",style="solid",fontname="Helvetica"];
  Node11 [label="/workplace/avs-device\l-sdk/SampleApp/include\l/SampleApp/KeywordObserver.h",height=0.2,width=0.4,color="black", fillcolor="white", style="filled",URL="$_keyword_observer_8h.html"];
  Node11 -> Node4 [dir="back",color="midnightblue",fontsize="10",style="solid",fontname="Helvetica"];
  Node11 -> Node12 [dir="back",color="midnightblue",fontsize="10",style="solid",fontname="Helvetica"];
  Node12 [label="/workplace/avs-device\l-sdk/SampleApp/src/KeywordObserver.cpp",height=0.2,width=0.4,color="black", fillcolor="white", style="filled",URL="$_keyword_observer_8cpp.html"];
  Node11 -> Node8 [dir="back",color="midnightblue",fontsize="10",style="solid",fontname="Helvetica"];
  Node1 -> Node13 [dir="back",color="midnightblue",fontsize="10",style="solid",fontname="Helvetica"];
  Node13 [label="/workplace/avs-device\l-sdk/CapabilityAgents\l/Settings/test/SettingsTest.cpp",height=0.2,width=0.4,color="black", fillcolor="white", style="filled",URL="$_settings_test_8cpp.html"];
  Node1 -> Node14 [dir="back",color="midnightblue",fontsize="10",style="solid",fontname="Helvetica"];
  Node14 [label="/workplace/avs-device\l-sdk/CertifiedSender\l/src/SQLiteMessageStorage.cpp",height=0.2,width=0.4,color="black", fillcolor="white", style="filled",URL="$_s_q_lite_message_storage_8cpp.html"];
  Node1 -> Node15 [dir="back",color="midnightblue",fontsize="10",style="solid",fontname="Helvetica"];
  Node15 [label="/workplace/avs-device\l-sdk/CertifiedSender\l/test/MessageStorageTest.cpp",height=0.2,width=0.4,color="black", fillcolor="white", style="filled",URL="$_message_storage_test_8cpp.html"];
  Node1 -> Node16 [dir="back",color="midnightblue",fontsize="10",style="solid",fontname="Helvetica"];
  Node16 [label="/workplace/avs-device\l-sdk/Integration/test\l/AlertsIntegrationTest.cpp",height=0.2,width=0.4,color="black", fillcolor="white", style="filled",URL="$_alerts_integration_test_8cpp.html"];
}
