digraph "/workplace/avs-device-sdk/AVSCommon/Utils/include/AVSCommon/Utils/functional/hash.h"
{
  edge [fontname="Helvetica",fontsize="10",labelfontname="Helvetica",labelfontsize="10"];
  node [fontname="Helvetica",fontsize="10",shape=record];
  Node1 [label="/workplace/avs-device\l-sdk/AVSCommon/Utils\l/include/AVSCommon/Utils\l/functional/hash.h",height=0.2,width=0.4,color="black", fillcolor="grey75", style="filled", fontcolor="black"];
  Node1 -> Node2 [dir="back",color="midnightblue",fontsize="10",style="solid",fontname="Helvetica"];
  Node2 [label="/workplace/avs-device\l-sdk/AVSCommon/AVS/src\l/CapabilityConfiguration.cpp",height=0.2,width=0.4,color="black", fillcolor="white", style="filled",URL="$_capability_configuration_8cpp.html"];
  Node1 -> Node3 [dir="back",color="midnightblue",fontsize="10",style="solid",fontname="Helvetica"];
  Node3 [label="/workplace/avs-device\l-sdk/AVSCommon/AVS/src\l/NamespaceAndName.cpp",height=0.2,width=0.4,color="black", fillcolor="white", style="filled",URL="$_namespace_and_name_8cpp.html"];
  Node1 -> Node4 [dir="back",color="midnightblue",fontsize="10",style="solid",fontname="Helvetica"];
  Node4 [label="/workplace/avs-device\l-sdk/AVSCommon/SDKInterfaces\l/include/AVSCommon/SDKInterfaces\l/Audio/EqualizerConfigurationInterface.h",height=0.2,width=0.4,color="black", fillcolor="white", style="filled",URL="$_equalizer_configuration_interface_8h.html"];
  Node4 -> Node5 [dir="back",color="midnightblue",fontsize="10",style="solid",fontname="Helvetica"];
  Node5 [label="/workplace/avs-device\l-sdk/ApplicationUtilities\l/DefaultClient/include/DefaultClient\l/DefaultClient.h",height=0.2,width=0.4,color="black", fillcolor="white", style="filled",URL="$_default_client_8h.html"];
  Node5 -> Node6 [dir="back",color="midnightblue",fontsize="10",style="solid",fontname="Helvetica"];
  Node6 [label="/workplace/avs-device\l-sdk/ApplicationUtilities\l/DefaultClient/src/DefaultClient.cpp",height=0.2,width=0.4,color="black", fillcolor="white", style="filled",URL="$_default_client_8cpp.html"];
  Node5 -> Node7 [dir="back",color="midnightblue",fontsize="10",style="solid",fontname="Helvetica"];
  Node7 [label="/workplace/avs-device\l-sdk/SampleApp/include\l/SampleApp/InteractionManager.h",height=0.2,width=0.4,color="black", fillcolor="white", style="filled",URL="$_interaction_manager_8h.html"];
  Node7 -> Node8 [dir="back",color="midnightblue",fontsize="10",style="solid",fontname="Helvetica"];
  Node8 [label="/workplace/avs-device\l-sdk/SampleApp/include\l/SampleApp/UserInputManager.h",height=0.2,width=0.4,color="red", fillcolor="white", style="filled",URL="$_user_input_manager_8h.html"];
  Node8 -> Node9 [dir="back",color="midnightblue",fontsize="10",style="solid",fontname="Helvetica"];
  Node9 [label="/workplace/avs-device\l-sdk/SampleApp/include\l/SampleApp/SampleApplication.h",height=0.2,width=0.4,color="black", fillcolor="white", style="filled",URL="$_sample_application_8h.html"];
  Node9 -> Node10 [dir="back",color="midnightblue",fontsize="10",style="solid",fontname="Helvetica"];
  Node10 [label="/workplace/avs-device\l-sdk/SampleApp/src/main.cpp",height=0.2,width=0.4,color="black", fillcolor="white", style="filled",URL="$main_8cpp.html"];
  Node9 -> Node11 [dir="back",color="midnightblue",fontsize="10",style="solid",fontname="Helvetica"];
  Node11 [label="/workplace/avs-device\l-sdk/SampleApp/src/SampleApplication.cpp",height=0.2,width=0.4,color="black", fillcolor="white", style="filled",URL="$_sample_application_8cpp.html"];
  Node7 -> Node12 [dir="back",color="midnightblue",fontsize="10",style="solid",fontname="Helvetica"];
  Node12 [label="/workplace/avs-device\l-sdk/SampleApp/src/Interaction\lManager.cpp",height=0.2,width=0.4,color="black", fillcolor="white", style="filled",URL="$_interaction_manager_8cpp.html"];
  Node5 -> Node13 [dir="back",color="midnightblue",fontsize="10",style="solid",fontname="Helvetica"];
  Node13 [label="/workplace/avs-device\l-sdk/SampleApp/include\l/SampleApp/KeywordObserver.h",height=0.2,width=0.4,color="black", fillcolor="white", style="filled",URL="$_keyword_observer_8h.html"];
  Node13 -> Node7 [dir="back",color="midnightblue",fontsize="10",style="solid",fontname="Helvetica"];
  Node13 -> Node14 [dir="back",color="midnightblue",fontsize="10",style="solid",fontname="Helvetica"];
  Node14 [label="/workplace/avs-device\l-sdk/SampleApp/src/KeywordObserver.cpp",height=0.2,width=0.4,color="black", fillcolor="white", style="filled",URL="$_keyword_observer_8cpp.html"];
  Node13 -> Node11 [dir="back",color="midnightblue",fontsize="10",style="solid",fontname="Helvetica"];
  Node4 -> Node15 [dir="back",color="midnightblue",fontsize="10",style="solid",fontname="Helvetica"];
  Node15 [label="/workplace/avs-device\l-sdk/ApplicationUtilities\l/DefaultClient/include/DefaultClient\l/EqualizerRuntimeSetup.h",height=0.2,width=0.4,color="black", fillcolor="white", style="filled",URL="$_equalizer_runtime_setup_8h.html"];
  Node15 -> Node5 [dir="back",color="midnightblue",fontsize="10",style="solid",fontname="Helvetica"];
  Node15 -> Node16 [dir="back",color="midnightblue",fontsize="10",style="solid",fontname="Helvetica"];
  Node16 [label="/workplace/avs-device\l-sdk/ApplicationUtilities\l/DefaultClient/src/EqualizerRuntime\lSetup.cpp",height=0.2,width=0.4,color="black", fillcolor="white", style="filled",URL="$_equalizer_runtime_setup_8cpp.html"];
  Node15 -> Node9 [dir="back",color="midnightblue",fontsize="10",style="solid",fontname="Helvetica"];
  Node4 -> Node17 [dir="back",color="midnightblue",fontsize="10",style="solid",fontname="Helvetica"];
  Node17 [label="/workplace/avs-device\l-sdk/AVSCommon/SDKInterfaces\l/test/AVSCommon/SDKInterfaces\l/Audio/MockEqualizerConfigurationInterface.h",height=0.2,width=0.4,color="black", fillcolor="white", style="filled",URL="$_mock_equalizer_configuration_interface_8h.html"];
  Node4 -> Node18 [dir="back",color="midnightblue",fontsize="10",style="solid",fontname="Helvetica"];
  Node18 [label="/workplace/avs-device\l-sdk/EqualizerImplementations\l/include/EqualizerImplementations\l/EqualizerController.h",height=0.2,width=0.4,color="black", fillcolor="white", style="filled",URL="$_equalizer_controller_8h.html"];
  Node18 -> Node5 [dir="back",color="midnightblue",fontsize="10",style="solid",fontname="Helvetica"];
  Node18 -> Node19 [dir="back",color="midnightblue",fontsize="10",style="solid",fontname="Helvetica"];
  Node19 [label="/workplace/avs-device\l-sdk/CapabilityAgents\l/Equalizer/include/Equalizer\l/EqualizerCapabilityAgent.h",height=0.2,width=0.4,color="black", fillcolor="white", style="filled",URL="$_equalizer_capability_agent_8h.html"];
  Node19 -> Node5 [dir="back",color="midnightblue",fontsize="10",style="solid",fontname="Helvetica"];
  Node19 -> Node20 [dir="back",color="midnightblue",fontsize="10",style="solid",fontname="Helvetica"];
  Node20 [label="/workplace/avs-device\l-sdk/CapabilityAgents\l/Equalizer/src/EqualizerCapability\lAgent.cpp",height=0.2,width=0.4,color="black", fillcolor="white", style="filled",URL="$_equalizer_capability_agent_8cpp.html"];
  Node18 -> Node21 [dir="back",color="midnightblue",fontsize="10",style="solid",fontname="Helvetica"];
  Node21 [label="/workplace/avs-device\l-sdk/EqualizerImplementations\l/src/EqualizerController.cpp",height=0.2,width=0.4,color="black", fillcolor="white", style="filled",URL="$_equalizer_controller_8cpp.html"];
  Node18 -> Node22 [dir="back",color="midnightblue",fontsize="10",style="solid",fontname="Helvetica"];
  Node22 [label="/workplace/avs-device\l-sdk/EqualizerImplementations\l/test/EqualizerControllerTest.cpp",height=0.2,width=0.4,color="black", fillcolor="white", style="filled",URL="$_equalizer_controller_test_8cpp.html"];
  Node18 -> Node11 [dir="back",color="midnightblue",fontsize="10",style="solid",fontname="Helvetica"];
  Node4 -> Node23 [dir="back",color="midnightblue",fontsize="10",style="solid",fontname="Helvetica"];
  Node23 [label="/workplace/avs-device\l-sdk/EqualizerImplementations\l/include/EqualizerImplementations\l/InMemoryEqualizerConfiguration.h",height=0.2,width=0.4,color="black", fillcolor="white", style="filled",URL="$_in_memory_equalizer_configuration_8h.html"];
  Node23 -> Node24 [dir="back",color="midnightblue",fontsize="10",style="solid",fontname="Helvetica"];
  Node24 [label="/workplace/avs-device\l-sdk/EqualizerImplementations\l/include/EqualizerImplementations\l/SDKConfigEqualizerConfiguration.h",height=0.2,width=0.4,color="black", fillcolor="white", style="filled",URL="$_s_d_k_config_equalizer_configuration_8h.html"];
  Node24 -> Node25 [dir="back",color="midnightblue",fontsize="10",style="solid",fontname="Helvetica"];
  Node25 [label="/workplace/avs-device\l-sdk/EqualizerImplementations\l/src/SDKConfigEqualizerConfiguration.cpp",height=0.2,width=0.4,color="black", fillcolor="white", style="filled",URL="$_s_d_k_config_equalizer_configuration_8cpp.html"];
  Node24 -> Node26 [dir="back",color="midnightblue",fontsize="10",style="solid",fontname="Helvetica"];
  Node26 [label="/workplace/avs-device\l-sdk/EqualizerImplementations\l/test/SDKConfigEqualizerConfiguration\lTest.cpp",height=0.2,width=0.4,color="black", fillcolor="white", style="filled",URL="$_s_d_k_config_equalizer_configuration_test_8cpp.html"];
  Node24 -> Node11 [dir="back",color="midnightblue",fontsize="10",style="solid",fontname="Helvetica"];
  Node23 -> Node27 [dir="back",color="midnightblue",fontsize="10",style="solid",fontname="Helvetica"];
  Node27 [label="/workplace/avs-device\l-sdk/EqualizerImplementations\l/src/InMemoryEqualizerConfiguration.cpp",height=0.2,width=0.4,color="black", fillcolor="white", style="filled",URL="$_in_memory_equalizer_configuration_8cpp.html"];
  Node23 -> Node22 [dir="back",color="midnightblue",fontsize="10",style="solid",fontname="Helvetica"];
  Node23 -> Node28 [dir="back",color="midnightblue",fontsize="10",style="solid",fontname="Helvetica"];
  Node28 [label="/workplace/avs-device\l-sdk/EqualizerImplementations\l/test/InMemoryEqualizerConfiguration\lTest.cpp",height=0.2,width=0.4,color="black", fillcolor="white", style="filled",URL="$_in_memory_equalizer_configuration_test_8cpp.html"];
  Node23 -> Node11 [dir="back",color="midnightblue",fontsize="10",style="solid",fontname="Helvetica"];
  Node4 -> Node24 [dir="back",color="midnightblue",fontsize="10",style="solid",fontname="Helvetica"];
  Node4 -> Node22 [dir="back",color="midnightblue",fontsize="10",style="solid",fontname="Helvetica"];
  Node1 -> Node29 [dir="back",color="midnightblue",fontsize="10",style="solid",fontname="Helvetica"];
  Node29 [label="/workplace/avs-device\l-sdk/AVSCommon/SDKInterfaces\l/include/AVSCommon/SDKInterfaces\l/Audio/EqualizerTypes.h",height=0.2,width=0.4,color="black", fillcolor="white", style="filled",URL="$_equalizer_types_8h.html"];
  Node29 -> Node4 [dir="back",color="midnightblue",fontsize="10",style="solid",fontname="Helvetica"];
  Node29 -> Node30 [dir="back",color="midnightblue",fontsize="10",style="solid",fontname="Helvetica"];
  Node30 [label="/workplace/avs-device\l-sdk/AVSCommon/SDKInterfaces\l/include/AVSCommon/SDKInterfaces\l/Audio/EqualizerControllerListenerInterface.h",height=0.2,width=0.4,color="black", fillcolor="white", style="filled",URL="$_equalizer_controller_listener_interface_8h.html"];
  Node30 -> Node15 [dir="back",color="midnightblue",fontsize="10",style="solid",fontname="Helvetica"];
  Node30 -> Node31 [dir="back",color="midnightblue",fontsize="10",style="solid",fontname="Helvetica"];
  Node31 [label="/workplace/avs-device\l-sdk/AVSCommon/SDKInterfaces\l/test/AVSCommon/SDKInterfaces\l/Audio/MockEqualizerControllerListener\lInterface.h",height=0.2,width=0.4,color="black", fillcolor="white", style="filled",URL="$_mock_equalizer_controller_listener_interface_8h.html"];
  Node31 -> Node22 [dir="back",color="midnightblue",fontsize="10",style="solid",fontname="Helvetica"];
  Node30 -> Node19 [dir="back",color="midnightblue",fontsize="10",style="solid",fontname="Helvetica"];
  Node30 -> Node18 [dir="back",color="midnightblue",fontsize="10",style="solid",fontname="Helvetica"];
  Node29 -> Node32 [dir="back",color="midnightblue",fontsize="10",style="solid",fontname="Helvetica"];
  Node32 [label="/workplace/avs-device\l-sdk/AVSCommon/SDKInterfaces\l/include/AVSCommon/SDKInterfaces\l/Audio/EqualizerInterface.h",height=0.2,width=0.4,color="black", fillcolor="white", style="filled",URL="$_equalizer_interface_8h.html"];
  Node32 -> Node15 [dir="back",color="midnightblue",fontsize="10",style="solid",fontname="Helvetica"];
  Node32 -> Node33 [dir="back",color="midnightblue",fontsize="10",style="solid",fontname="Helvetica"];
  Node33 [label="/workplace/avs-device\l-sdk/AVSCommon/SDKInterfaces\l/test/AVSCommon/SDKInterfaces\l/Audio/MockEqualizerInterface.h",height=0.2,width=0.4,color="black", fillcolor="white", style="filled",URL="$_mock_equalizer_interface_8h.html"];
  Node33 -> Node22 [dir="back",color="midnightblue",fontsize="10",style="solid",fontname="Helvetica"];
  Node32 -> Node18 [dir="back",color="midnightblue",fontsize="10",style="solid",fontname="Helvetica"];
  Node32 -> Node34 [dir="back",color="midnightblue",fontsize="10",style="solid",fontname="Helvetica"];
  Node34 [label="/workplace/avs-device\l-sdk/MediaPlayer/AndroidSLESMedia\lPlayer/include/AndroidSLESMediaPlayer\l/AndroidSLESMediaPlayer.h",height=0.2,width=0.4,color="red", fillcolor="white", style="filled",URL="$_android_s_l_e_s_media_player_8h.html"];
  Node34 -> Node35 [dir="back",color="midnightblue",fontsize="10",style="solid",fontname="Helvetica"];
  Node35 [label="/workplace/avs-device\l-sdk/MediaPlayer/AndroidSLESMedia\lPlayer/src/AndroidSLESMediaPlayer.cpp",height=0.2,width=0.4,color="black", fillcolor="white", style="filled",URL="$_android_s_l_e_s_media_player_8cpp.html"];
  Node32 -> Node36 [dir="back",color="midnightblue",fontsize="10",style="solid",fontname="Helvetica"];
  Node36 [label="/workplace/avs-device\l-sdk/MediaPlayer/GStreamerMedia\lPlayer/include/MediaPlayer\l/MediaPlayer.h",height=0.2,width=0.4,color="red", fillcolor="white", style="filled",URL="$_media_player_8h.html"];
  Node29 -> Node37 [dir="back",color="midnightblue",fontsize="10",style="solid",fontname="Helvetica"];
  Node37 [label="/workplace/avs-device\l-sdk/AVSCommon/SDKInterfaces\l/include/AVSCommon/SDKInterfaces\l/Audio/EqualizerModeControllerInterface.h",height=0.2,width=0.4,color="black", fillcolor="white", style="filled",URL="$_equalizer_mode_controller_interface_8h.html"];
  Node37 -> Node5 [dir="back",color="midnightblue",fontsize="10",style="solid",fontname="Helvetica"];
  Node37 -> Node15 [dir="back",color="midnightblue",fontsize="10",style="solid",fontname="Helvetica"];
  Node37 -> Node38 [dir="back",color="midnightblue",fontsize="10",style="solid",fontname="Helvetica"];
  Node38 [label="/workplace/avs-device\l-sdk/AVSCommon/SDKInterfaces\l/test/AVSCommon/SDKInterfaces\l/Audio/MockEqualizerModeControllerInterface.h",height=0.2,width=0.4,color="black", fillcolor="white", style="filled",URL="$_mock_equalizer_mode_controller_interface_8h.html"];
  Node38 -> Node22 [dir="back",color="midnightblue",fontsize="10",style="solid",fontname="Helvetica"];
  Node37 -> Node19 [dir="back",color="midnightblue",fontsize="10",style="solid",fontname="Helvetica"];
  Node37 -> Node18 [dir="back",color="midnightblue",fontsize="10",style="solid",fontname="Helvetica"];
  Node37 -> Node39 [dir="back",color="midnightblue",fontsize="10",style="solid",fontname="Helvetica"];
  Node39 [label="/workplace/avs-device\l-sdk/SampleApp/include\l/SampleApp/SampleEqualizerMode\lController.h",height=0.2,width=0.4,color="red", fillcolor="white", style="filled",URL="$_sample_equalizer_mode_controller_8h.html"];
  Node39 -> Node11 [dir="back",color="midnightblue",fontsize="10",style="solid",fontname="Helvetica"];
  Node29 -> Node40 [dir="back",color="midnightblue",fontsize="10",style="solid",fontname="Helvetica"];
  Node40 [label="/workplace/avs-device\l-sdk/AVSCommon/SDKInterfaces\l/include/AVSCommon/SDKInterfaces\l/Audio/EqualizerStorageInterface.h",height=0.2,width=0.4,color="black", fillcolor="white", style="filled",URL="$_equalizer_storage_interface_8h.html"];
  Node40 -> Node5 [dir="back",color="midnightblue",fontsize="10",style="solid",fontname="Helvetica"];
  Node40 -> Node15 [dir="back",color="midnightblue",fontsize="10",style="solid",fontname="Helvetica"];
  Node40 -> Node41 [dir="back",color="midnightblue",fontsize="10",style="solid",fontname="Helvetica"];
  Node41 [label="/workplace/avs-device\l-sdk/AVSCommon/SDKInterfaces\l/test/AVSCommon/SDKInterfaces\l/Audio/EqualizerStorageInterfaceTest.h",height=0.2,width=0.4,color="red", fillcolor="white", style="filled",URL="$_equalizer_storage_interface_test_8h.html"];
  Node40 -> Node42 [dir="back",color="midnightblue",fontsize="10",style="solid",fontname="Helvetica"];
  Node42 [label="/workplace/avs-device\l-sdk/AVSCommon/SDKInterfaces\l/test/AVSCommon/SDKInterfaces\l/Audio/MockEqualizerStorageInterface.h",height=0.2,width=0.4,color="black", fillcolor="white", style="filled",URL="$_mock_equalizer_storage_interface_8h.html"];
  Node42 -> Node22 [dir="back",color="midnightblue",fontsize="10",style="solid",fontname="Helvetica"];
  Node40 -> Node19 [dir="back",color="midnightblue",fontsize="10",style="solid",fontname="Helvetica"];
  Node40 -> Node18 [dir="back",color="midnightblue",fontsize="10",style="solid",fontname="Helvetica"];
  Node40 -> Node43 [dir="back",color="midnightblue",fontsize="10",style="solid",fontname="Helvetica"];
  Node43 [label="/workplace/avs-device\l-sdk/EqualizerImplementations\l/include/EqualizerImplementations\l/MiscDBEqualizerStorage.h",height=0.2,width=0.4,color="red", fillcolor="white", style="filled",URL="$_misc_d_b_equalizer_storage_8h.html"];
  Node43 -> Node44 [dir="back",color="midnightblue",fontsize="10",style="solid",fontname="Helvetica"];
  Node44 [label="/workplace/avs-device\l-sdk/EqualizerImplementations\l/src/MiscDBEqualizerStorage.cpp",height=0.2,width=0.4,color="black", fillcolor="white", style="filled",URL="$_misc_d_b_equalizer_storage_8cpp.html"];
  Node43 -> Node11 [dir="back",color="midnightblue",fontsize="10",style="solid",fontname="Helvetica"];
  Node29 -> Node45 [dir="back",color="midnightblue",fontsize="10",style="solid",fontname="Helvetica"];
  Node45 [label="/workplace/avs-device\l-sdk/EqualizerImplementations\l/include/EqualizerImplementations\l/EqualizerBandMapperInterface.h",height=0.2,width=0.4,color="black", fillcolor="white", style="filled",URL="$_equalizer_band_mapper_interface_8h.html"];
  Node45 -> Node46 [dir="back",color="midnightblue",fontsize="10",style="solid",fontname="Helvetica"];
  Node46 [label="/workplace/avs-device\l-sdk/EqualizerImplementations\l/include/EqualizerImplementations\l/EqualizerLinearBandMapper.h",height=0.2,width=0.4,color="black", fillcolor="white", style="filled",URL="$_equalizer_linear_band_mapper_8h.html"];
  Node46 -> Node47 [dir="back",color="midnightblue",fontsize="10",style="solid",fontname="Helvetica"];
  Node47 [label="/workplace/avs-device\l-sdk/EqualizerImplementations\l/src/EqualizerLinearBandMapper.cpp",height=0.2,width=0.4,color="black", fillcolor="white", style="filled",URL="$_equalizer_linear_band_mapper_8cpp.html"];
  Node46 -> Node48 [dir="back",color="midnightblue",fontsize="10",style="solid",fontname="Helvetica"];
  Node48 [label="/workplace/avs-device\l-sdk/EqualizerImplementations\l/test/EqualizerLinearBandMapperTest.cpp",height=0.2,width=0.4,color="black", fillcolor="white", style="filled",URL="$_equalizer_linear_band_mapper_test_8cpp.html"];
  Node46 -> Node35 [dir="back",color="midnightblue",fontsize="10",style="solid",fontname="Helvetica"];
  Node45 -> Node34 [dir="back",color="midnightblue",fontsize="10",style="solid",fontname="Helvetica"];
  Node29 -> Node46 [dir="back",color="midnightblue",fontsize="10",style="solid",fontname="Helvetica"];
  Node29 -> Node49 [dir="back",color="midnightblue",fontsize="10",style="solid",fontname="Helvetica"];
  Node49 [label="/workplace/avs-device\l-sdk/EqualizerImplementations\l/include/EqualizerImplementations\l/EqualizerUtils.h",height=0.2,width=0.4,color="black", fillcolor="white", style="filled",URL="$_equalizer_utils_8h.html"];
  Node49 -> Node50 [dir="back",color="midnightblue",fontsize="10",style="solid",fontname="Helvetica"];
  Node50 [label="/workplace/avs-device\l-sdk/EqualizerImplementations\l/src/EqualizerUtils.cpp",height=0.2,width=0.4,color="black", fillcolor="white", style="filled",URL="$_equalizer_utils_8cpp.html"];
  Node49 -> Node44 [dir="back",color="midnightblue",fontsize="10",style="solid",fontname="Helvetica"];
  Node29 -> Node48 [dir="back",color="midnightblue",fontsize="10",style="solid",fontname="Helvetica"];
}
