digraph "alexaClientSDK::avsCommon::utils::playlistParser::PlaylistParserObserverInterface"
{
  edge [fontname="Helvetica",fontsize="10",labelfontname="Helvetica",labelfontsize="10"];
  node [fontname="Helvetica",fontsize="10",shape=record];
  rankdir="LR";
  Node1 [label="alexaClientSDK::avsCommon\l::utils::playlistParser\l::PlaylistParserObserverInterface",height=0.2,width=0.4,color="black", fillcolor="grey75", style="filled", fontcolor="black"];
  Node1 -> Node2 [dir="back",color="midnightblue",fontsize="10",style="solid",fontname="Helvetica"];
  Node2 [label="alexaClientSDK::playlist\lParser::test::TestParserObserver",height=0.2,width=0.4,color="black", fillcolor="white", style="filled",URL="$classalexa_client_s_d_k_1_1playlist_parser_1_1test_1_1_test_parser_observer.html"];
  Node1 -> Node3 [dir="back",color="midnightblue",fontsize="10",style="solid",fontname="Helvetica"];
  Node3 [label="alexaClientSDK::playlist\lParser::UrlContentToAttachment\lConverter",height=0.2,width=0.4,color="black", fillcolor="white", style="filled",URL="$classalexa_client_s_d_k_1_1playlist_parser_1_1_url_content_to_attachment_converter.html",tooltip="Class that handles the streaming of urls containing media into Attachments. "];
}
