digraph "/workplace/avs-device-sdk/AVSCommon/Utils/src/JSON" {
  compound=true
  node [ fontsize="10", fontname="Helvetica"];
  edge [ labelfontsize="10", labelfontname="Helvetica"];
  subgraph clusterdir_93a54634d0ab52618b36b15672961616 {
    graph [ bgcolor="#ddddee", pencolor="black", label="src" fontname="Helvetica", fontsize="10", URL="dir_93a54634d0ab52618b36b15672961616.html"]
  dir_50efded679c12b68a8ba2c5ec67a83ea [shape=box, label="JSON", style="filled", fillcolor="#eeeeff", pencolor="black", URL="dir_50efded679c12b68a8ba2c5ec67a83ea.html"];
  }
  dir_957fc395b73dfe8b64ee3f74464f588a [shape=box label="include" fillcolor="white" style="filled" color="red" URL="dir_957fc395b73dfe8b64ee3f74464f588a.html"];
  dir_50efded679c12b68a8ba2c5ec67a83ea->dir_957fc395b73dfe8b64ee3f74464f588a [headlabel="5", labeldistance=1.5 headhref="dir_000110_000080.html"];
}
