digraph "/workplace/avs-device-sdk/AVSCommon/SDKInterfaces/include/AVSCommon/SDKInterfaces/Bluetooth/Services/AVRCPControllerInterface.h"
{
  edge [fontname="Helvetica",fontsize="10",labelfontname="Helvetica",labelfontsize="10"];
  node [fontname="Helvetica",fontsize="10",shape=record];
  Node1 [label="/workplace/avs-device\l-sdk/AVSCommon/SDKInterfaces\l/include/AVSCommon/SDKInterfaces\l/Bluetooth/Services/AVRCPControllerInterface.h",height=0.2,width=0.4,color="black", fillcolor="grey75", style="filled", fontcolor="black"];
  Node1 -> Node2 [color="midnightblue",fontsize="10",style="solid",fontname="Helvetica"];
  Node2 [label="AVSCommon/SDKInterfaces\l/Bluetooth/Services/Bluetooth\lServiceInterface.h",height=0.2,width=0.4,color="black", fillcolor="white", style="filled",URL="$_bluetooth_service_interface_8h.html"];
  Node2 -> Node3 [color="midnightblue",fontsize="10",style="solid",fontname="Helvetica"];
  Node3 [label="memory",height=0.2,width=0.4,color="grey75", fillcolor="white", style="filled"];
  Node2 -> Node4 [color="midnightblue",fontsize="10",style="solid",fontname="Helvetica"];
  Node4 [label="AVSCommon/SDKInterfaces\l/Bluetooth/Services/SDPRecord\lInterface.h",height=0.2,width=0.4,color="black", fillcolor="white", style="filled",URL="$_s_d_p_record_interface_8h.html"];
  Node4 -> Node5 [color="midnightblue",fontsize="10",style="solid",fontname="Helvetica"];
  Node5 [label="string",height=0.2,width=0.4,color="grey75", fillcolor="white", style="filled"];
}
