digraph "/workplace/avs-device-sdk/AVSCommon/AVS/src/CapabilityAgent.cpp"
{
  edge [fontname="Helvetica",fontsize="10",labelfontname="Helvetica",labelfontsize="10"];
  node [fontname="Helvetica",fontsize="10",shape=record];
  Node1 [label="/workplace/avs-device\l-sdk/AVSCommon/AVS/src\l/CapabilityAgent.cpp",height=0.2,width=0.4,color="black", fillcolor="grey75", style="filled", fontcolor="black"];
  Node1 -> Node2 [color="midnightblue",fontsize="10",style="solid",fontname="Helvetica"];
  Node2 [label="rapidjson/document.h",height=0.2,width=0.4,color="grey75", fillcolor="white", style="filled"];
  Node1 -> Node3 [color="midnightblue",fontsize="10",style="solid",fontname="Helvetica"];
  Node3 [label="rapidjson/stringbuffer.h",height=0.2,width=0.4,color="grey75", fillcolor="white", style="filled"];
  Node1 -> Node4 [color="midnightblue",fontsize="10",style="solid",fontname="Helvetica"];
  Node4 [label="rapidjson/writer.h",height=0.2,width=0.4,color="grey75", fillcolor="white", style="filled"];
  Node1 -> Node5 [color="midnightblue",fontsize="10",style="solid",fontname="Helvetica"];
  Node5 [label="AVSCommon/Utils/Logger\l/Logger.h",height=0.2,width=0.4,color="black", fillcolor="white", style="filled",URL="$_logger_8h.html"];
  Node5 -> Node6 [color="midnightblue",fontsize="10",style="solid",fontname="Helvetica"];
  Node6 [label="atomic",height=0.2,width=0.4,color="grey75", fillcolor="white", style="filled"];
  Node5 -> Node7 [color="midnightblue",fontsize="10",style="solid",fontname="Helvetica"];
  Node7 [label="chrono",height=0.2,width=0.4,color="grey75", fillcolor="white", style="filled"];
  Node5 -> Node8 [color="midnightblue",fontsize="10",style="solid",fontname="Helvetica"];
  Node8 [label="mutex",height=0.2,width=0.4,color="grey75", fillcolor="white", style="filled"];
  Node5 -> Node9 [color="midnightblue",fontsize="10",style="solid",fontname="Helvetica"];
  Node9 [label="sstream",height=0.2,width=0.4,color="grey75", fillcolor="white", style="filled"];
  Node5 -> Node10 [color="midnightblue",fontsize="10",style="solid",fontname="Helvetica"];
  Node10 [label="vector",height=0.2,width=0.4,color="grey75", fillcolor="white", style="filled"];
  Node5 -> Node11 [color="midnightblue",fontsize="10",style="solid",fontname="Helvetica"];
  Node11 [label="AVSCommon/Utils/Configuration\l/ConfigurationNode.h",height=0.2,width=0.4,color="black", fillcolor="white", style="filled",URL="$_configuration_node_8h.html"];
  Node11 -> Node7 [color="midnightblue",fontsize="10",style="solid",fontname="Helvetica"];
  Node11 -> Node12 [color="midnightblue",fontsize="10",style="solid",fontname="Helvetica"];
  Node12 [label="iostream",height=0.2,width=0.4,color="grey75", fillcolor="white", style="filled"];
  Node11 -> Node13 [color="midnightblue",fontsize="10",style="solid",fontname="Helvetica"];
  Node13 [label="memory",height=0.2,width=0.4,color="grey75", fillcolor="white", style="filled"];
  Node11 -> Node8 [color="midnightblue",fontsize="10",style="solid",fontname="Helvetica"];
  Node11 -> Node14 [color="midnightblue",fontsize="10",style="solid",fontname="Helvetica"];
  Node14 [label="string",height=0.2,width=0.4,color="grey75", fillcolor="white", style="filled"];
  Node11 -> Node10 [color="midnightblue",fontsize="10",style="solid",fontname="Helvetica"];
  Node11 -> Node2 [color="midnightblue",fontsize="10",style="solid",fontname="Helvetica"];
  Node5 -> Node15 [color="midnightblue",fontsize="10",style="solid",fontname="Helvetica"];
  Node15 [label="AVSCommon/Utils/Logger\l/Level.h",height=0.2,width=0.4,color="black", fillcolor="white", style="filled",URL="$_level_8h.html"];
  Node15 -> Node14 [color="midnightblue",fontsize="10",style="solid",fontname="Helvetica"];
  Node5 -> Node16 [color="midnightblue",fontsize="10",style="solid",fontname="Helvetica"];
  Node16 [label="AVSCommon/Utils/Logger\l/LogEntry.h",height=0.2,width=0.4,color="black", fillcolor="white", style="filled",URL="$_log_entry_8h.html"];
  Node16 -> Node9 [color="midnightblue",fontsize="10",style="solid",fontname="Helvetica"];
  Node16 -> Node14 [color="midnightblue",fontsize="10",style="solid",fontname="Helvetica"];
  Node16 -> Node17 [color="midnightblue",fontsize="10",style="solid",fontname="Helvetica"];
  Node17 [label="AVSCommon/Utils/Logger\l/LogEntryStream.h",height=0.2,width=0.4,color="black", fillcolor="white", style="filled",URL="$_log_entry_stream_8h.html"];
  Node17 -> Node18 [color="midnightblue",fontsize="10",style="solid",fontname="Helvetica"];
  Node18 [label="ostream",height=0.2,width=0.4,color="grey75", fillcolor="white", style="filled"];
  Node17 -> Node19 [color="midnightblue",fontsize="10",style="solid",fontname="Helvetica"];
  Node19 [label="AVSCommon/Utils/Logger\l/LogEntryBuffer.h",height=0.2,width=0.4,color="black", fillcolor="white", style="filled",URL="$_log_entry_buffer_8h.html"];
  Node19 -> Node13 [color="midnightblue",fontsize="10",style="solid",fontname="Helvetica"];
  Node19 -> Node20 [color="midnightblue",fontsize="10",style="solid",fontname="Helvetica"];
  Node20 [label="streambuf",height=0.2,width=0.4,color="grey75", fillcolor="white", style="filled"];
  Node19 -> Node10 [color="midnightblue",fontsize="10",style="solid",fontname="Helvetica"];
  Node5 -> Node21 [color="midnightblue",fontsize="10",style="solid",fontname="Helvetica"];
  Node21 [label="AVSCommon/Utils/Logger\l/LogLevelObserverInterface.h",height=0.2,width=0.4,color="black", fillcolor="white", style="filled",URL="$_log_level_observer_interface_8h.html"];
  Node21 -> Node15 [color="midnightblue",fontsize="10",style="solid",fontname="Helvetica"];
  Node5 -> Node22 [color="midnightblue",fontsize="10",style="solid",fontname="Helvetica"];
  Node22 [label="AVSCommon/Utils/Logger\l/SinkObserverInterface.h",height=0.2,width=0.4,color="black", fillcolor="white", style="filled",URL="$_sink_observer_interface_8h.html"];
  Node22 -> Node13 [color="midnightblue",fontsize="10",style="solid",fontname="Helvetica"];
  Node1 -> Node23 [color="midnightblue",fontsize="10",style="solid",fontname="Helvetica"];
  Node23 [label="AVSCommon/Utils/UUIDGeneration\l/UUIDGeneration.h",height=0.2,width=0.4,color="black", fillcolor="white", style="filled",URL="$_u_u_i_d_generation_8h.html"];
  Node23 -> Node14 [color="midnightblue",fontsize="10",style="solid",fontname="Helvetica"];
  Node1 -> Node24 [color="midnightblue",fontsize="10",style="solid",fontname="Helvetica"];
  Node24 [label="AVSCommon/AVS/Capability\lAgent.h",height=0.2,width=0.4,color="black", fillcolor="white", style="filled",URL="$_capability_agent_8h.html"];
  Node24 -> Node6 [color="midnightblue",fontsize="10",style="solid",fontname="Helvetica"];
  Node24 -> Node25 [color="midnightblue",fontsize="10",style="solid",fontname="Helvetica"];
  Node25 [label="unordered_map",height=0.2,width=0.4,color="grey75", fillcolor="white", style="filled"];
  Node24 -> Node14 [color="midnightblue",fontsize="10",style="solid",fontname="Helvetica"];
  Node24 -> Node13 [color="midnightblue",fontsize="10",style="solid",fontname="Helvetica"];
  Node24 -> Node26 [color="midnightblue",fontsize="10",style="solid",fontname="Helvetica"];
  Node26 [label="AVSCommon/AVS/NamespaceAnd\lName.h",height=0.2,width=0.4,color="black", fillcolor="white", style="filled",URL="$_namespace_and_name_8h.html"];
  Node26 -> Node14 [color="midnightblue",fontsize="10",style="solid",fontname="Helvetica"];
  Node24 -> Node27 [color="midnightblue",fontsize="10",style="solid",fontname="Helvetica"];
  Node27 [label="AVSCommon/SDKInterfaces\l/ExceptionEncounteredSenderInterface.h",height=0.2,width=0.4,color="black", fillcolor="white", style="filled",URL="$_exception_encountered_sender_interface_8h.html"];
  Node27 -> Node28 [color="midnightblue",fontsize="10",style="solid",fontname="Helvetica"];
  Node28 [label="AVSCommon/AVS/ExceptionError\lType.h",height=0.2,width=0.4,color="black", fillcolor="white", style="filled",URL="$_exception_error_type_8h.html"];
  Node28 -> Node12 [color="midnightblue",fontsize="10",style="solid",fontname="Helvetica"];
  Node24 -> Node29 [color="midnightblue",fontsize="10",style="solid",fontname="Helvetica"];
  Node29 [label="AVSCommon/SDKInterfaces\l/ChannelObserverInterface.h",height=0.2,width=0.4,color="black", fillcolor="white", style="filled",URL="$_channel_observer_interface_8h.html"];
  Node29 -> Node30 [color="midnightblue",fontsize="10",style="solid",fontname="Helvetica"];
  Node30 [label="AVSCommon/AVS/FocusState.h",height=0.2,width=0.4,color="black", fillcolor="white", style="filled",URL="$_focus_state_8h.html"];
  Node30 -> Node14 [color="midnightblue",fontsize="10",style="solid",fontname="Helvetica"];
  Node24 -> Node31 [color="midnightblue",fontsize="10",style="solid",fontname="Helvetica"];
  Node31 [label="AVSCommon/SDKInterfaces\l/ContextRequesterInterface.h",height=0.2,width=0.4,color="black", fillcolor="white", style="filled",URL="$_context_requester_interface_8h.html"];
  Node31 -> Node14 [color="midnightblue",fontsize="10",style="solid",fontname="Helvetica"];
  Node31 -> Node18 [color="midnightblue",fontsize="10",style="solid",fontname="Helvetica"];
  Node24 -> Node32 [color="midnightblue",fontsize="10",style="solid",fontname="Helvetica"];
  Node32 [label="AVSCommon/SDKInterfaces\l/StateProviderInterface.h",height=0.2,width=0.4,color="black", fillcolor="white", style="filled",URL="$_state_provider_interface_8h.html"];
  Node32 -> Node26 [color="midnightblue",fontsize="10",style="solid",fontname="Helvetica"];
  Node24 -> Node33 [color="midnightblue",fontsize="10",style="solid",fontname="Helvetica"];
  Node33 [label="AVSCommon/SDKInterfaces\l/DirectiveHandlerInterface.h",height=0.2,width=0.4,color="black", fillcolor="white", style="filled",URL="$_directive_handler_interface_8h.html"];
  Node33 -> Node13 [color="midnightblue",fontsize="10",style="solid",fontname="Helvetica"];
  Node33 -> Node34 [color="midnightblue",fontsize="10",style="solid",fontname="Helvetica"];
  Node34 [label="AVSCommon/AVS/AVSDirective.h",height=0.2,width=0.4,color="black", fillcolor="white", style="filled",URL="$_a_v_s_directive_8h.html"];
  Node34 -> Node12 [color="midnightblue",fontsize="10",style="solid",fontname="Helvetica"];
  Node34 -> Node13 [color="midnightblue",fontsize="10",style="solid",fontname="Helvetica"];
  Node34 -> Node14 [color="midnightblue",fontsize="10",style="solid",fontname="Helvetica"];
  Node34 -> Node35 [color="midnightblue",fontsize="10",style="solid",fontname="Helvetica"];
  Node35 [label="utility",height=0.2,width=0.4,color="grey75", fillcolor="white", style="filled"];
  Node34 -> Node36 [color="midnightblue",fontsize="10",style="solid",fontname="Helvetica"];
  Node36 [label="Attachment/AttachmentManager\lInterface.h",height=0.2,width=0.4,color="black", fillcolor="white", style="filled",URL="$_attachment_manager_interface_8h.html"];
  Node36 -> Node7 [color="midnightblue",fontsize="10",style="solid",fontname="Helvetica"];
  Node36 -> Node14 [color="midnightblue",fontsize="10",style="solid",fontname="Helvetica"];
  Node36 -> Node13 [color="midnightblue",fontsize="10",style="solid",fontname="Helvetica"];
  Node36 -> Node37 [color="midnightblue",fontsize="10",style="solid",fontname="Helvetica"];
  Node37 [label="AVSCommon/AVS/Attachment\l/Attachment.h",height=0.2,width=0.4,color="black", fillcolor="white", style="filled",URL="$_attachment_8h.html"];
  Node37 -> Node6 [color="midnightblue",fontsize="10",style="solid",fontname="Helvetica"];
  Node37 -> Node8 [color="midnightblue",fontsize="10",style="solid",fontname="Helvetica"];
  Node37 -> Node14 [color="midnightblue",fontsize="10",style="solid",fontname="Helvetica"];
  Node37 -> Node38 [color="midnightblue",fontsize="10",style="solid",fontname="Helvetica"];
  Node38 [label="AVSCommon/AVS/Attachment\l/AttachmentReader.h",height=0.2,width=0.4,color="black", fillcolor="white", style="filled",URL="$_attachment_reader_8h.html"];
  Node38 -> Node7 [color="midnightblue",fontsize="10",style="solid",fontname="Helvetica"];
  Node38 -> Node39 [color="midnightblue",fontsize="10",style="solid",fontname="Helvetica"];
  Node39 [label="cstddef",height=0.2,width=0.4,color="grey75", fillcolor="white", style="filled"];
  Node38 -> Node18 [color="midnightblue",fontsize="10",style="solid",fontname="Helvetica"];
  Node38 -> Node40 [color="midnightblue",fontsize="10",style="solid",fontname="Helvetica"];
  Node40 [label="AVSCommon/Utils/SDS\l/ReaderPolicy.h",height=0.2,width=0.4,color="black", fillcolor="white", style="filled",URL="$_reader_policy_8h.html"];
  Node37 -> Node41 [color="midnightblue",fontsize="10",style="solid",fontname="Helvetica"];
  Node41 [label="AVSCommon/AVS/Attachment\l/AttachmentWriter.h",height=0.2,width=0.4,color="black", fillcolor="white", style="filled",URL="$_attachment_writer_8h.html"];
  Node41 -> Node7 [color="midnightblue",fontsize="10",style="solid",fontname="Helvetica"];
  Node41 -> Node39 [color="midnightblue",fontsize="10",style="solid",fontname="Helvetica"];
  Node37 -> Node42 [color="midnightblue",fontsize="10",style="solid",fontname="Helvetica"];
  Node42 [label="AVSCommon/Utils/SDS\l/InProcessSDS.h",height=0.2,width=0.4,color="red", fillcolor="white", style="filled",URL="$_in_process_s_d_s_8h.html"];
  Node42 -> Node10 [color="midnightblue",fontsize="10",style="solid",fontname="Helvetica"];
  Node42 -> Node8 [color="midnightblue",fontsize="10",style="solid",fontname="Helvetica"];
  Node42 -> Node6 [color="midnightblue",fontsize="10",style="solid",fontname="Helvetica"];
  Node42 -> Node14 [color="midnightblue",fontsize="10",style="solid",fontname="Helvetica"];
  Node37 -> Node40 [color="midnightblue",fontsize="10",style="solid",fontname="Helvetica"];
  Node37 -> Node43 [color="midnightblue",fontsize="10",style="solid",fontname="Helvetica"];
  Node43 [label="WriterPolicy.h",height=0.2,width=0.4,color="black", fillcolor="white", style="filled",URL="$_writer_policy_8h.html"];
  Node36 -> Node38 [color="midnightblue",fontsize="10",style="solid",fontname="Helvetica"];
  Node36 -> Node41 [color="midnightblue",fontsize="10",style="solid",fontname="Helvetica"];
  Node34 -> Node44 [color="midnightblue",fontsize="10",style="solid",fontname="Helvetica"];
  Node44 [label="AVSMessage.h",height=0.2,width=0.4,color="black", fillcolor="white", style="filled",URL="$_a_v_s_message_8h.html"];
  Node44 -> Node45 [color="midnightblue",fontsize="10",style="solid",fontname="Helvetica"];
  Node45 [label="AVSMessageHeader.h",height=0.2,width=0.4,color="black", fillcolor="white", style="filled",URL="$_a_v_s_message_header_8h.html"];
  Node45 -> Node14 [color="midnightblue",fontsize="10",style="solid",fontname="Helvetica"];
  Node44 -> Node13 [color="midnightblue",fontsize="10",style="solid",fontname="Helvetica"];
  Node44 -> Node14 [color="midnightblue",fontsize="10",style="solid",fontname="Helvetica"];
  Node33 -> Node46 [color="midnightblue",fontsize="10",style="solid",fontname="Helvetica"];
  Node46 [label="AVSCommon/AVS/DirectiveHandler\lConfiguration.h",height=0.2,width=0.4,color="black", fillcolor="white", style="filled",URL="$_directive_handler_configuration_8h.html"];
  Node46 -> Node25 [color="midnightblue",fontsize="10",style="solid",fontname="Helvetica"];
  Node46 -> Node26 [color="midnightblue",fontsize="10",style="solid",fontname="Helvetica"];
  Node46 -> Node47 [color="midnightblue",fontsize="10",style="solid",fontname="Helvetica"];
  Node47 [label="BlockingPolicy.h",height=0.2,width=0.4,color="black", fillcolor="white", style="filled",URL="$_blocking_policy_8h.html"];
  Node47 -> Node48 [color="midnightblue",fontsize="10",style="solid",fontname="Helvetica"];
  Node48 [label="bitset",height=0.2,width=0.4,color="grey75", fillcolor="white", style="filled"];
  Node47 -> Node12 [color="midnightblue",fontsize="10",style="solid",fontname="Helvetica"];
  Node33 -> Node49 [color="midnightblue",fontsize="10",style="solid",fontname="Helvetica"];
  Node49 [label="AVSCommon/SDKInterfaces\l/DirectiveHandlerResultInterface.h",height=0.2,width=0.4,color="black", fillcolor="white", style="filled",URL="$_directive_handler_result_interface_8h.html"];
  Node49 -> Node13 [color="midnightblue",fontsize="10",style="solid",fontname="Helvetica"];
  Node49 -> Node34 [color="midnightblue",fontsize="10",style="solid",fontname="Helvetica"];
  Node24 -> Node49 [color="midnightblue",fontsize="10",style="solid",fontname="Helvetica"];
  Node1 -> Node50 [color="midnightblue",fontsize="10",style="solid",fontname="Helvetica"];
  Node50 [label="AVSCommon/AVS/EventBuilder.h",height=0.2,width=0.4,color="black", fillcolor="white", style="filled",URL="$_event_builder_8h.html"];
  Node50 -> Node14 [color="midnightblue",fontsize="10",style="solid",fontname="Helvetica"];
  Node50 -> Node35 [color="midnightblue",fontsize="10",style="solid",fontname="Helvetica"];
}
