digraph "/workplace/avs-device-sdk/AVSCommon/AVS/include/AVSCommon/AVS" {
  compound=true
  node [ fontsize="10", fontname="Helvetica"];
  edge [ labelfontsize="10", labelfontname="Helvetica"];
  subgraph clusterdir_4c314a0d19d1aa5c860795d42a926e2c {
    graph [ bgcolor="#ddddee", pencolor="black", label="AVSCommon" fontname="Helvetica", fontsize="10", URL="dir_4c314a0d19d1aa5c860795d42a926e2c.html"]
  subgraph clusterdir_1b86ff6fe19386d1d992f6fa0aca02b2 {
    graph [ bgcolor="#eeeeff", pencolor="black", label="" URL="dir_1b86ff6fe19386d1d992f6fa0aca02b2.html"];
    dir_1b86ff6fe19386d1d992f6fa0aca02b2 [shape=plaintext label="AVS"];
    dir_16fdf1dd5a4e411cf30486cba4ef2640 [shape=box label="Attachment" color="black" fillcolor="white" style="filled" URL="dir_16fdf1dd5a4e411cf30486cba4ef2640.html"];
    dir_7c0f72e3b40394b6419f2d29748370b1 [shape=box label="ExternalMediaPlayer" color="black" fillcolor="white" style="filled" URL="dir_7c0f72e3b40394b6419f2d29748370b1.html"];
    dir_0cdc2576cbdff8bbeec8f5cd9892073c [shape=box label="Initialization" color="black" fillcolor="white" style="filled" URL="dir_0cdc2576cbdff8bbeec8f5cd9892073c.html"];
    dir_b7463c83c41dae53927c12ce5c5c2e58 [shape=box label="SpeakerConstants" color="black" fillcolor="white" style="filled" URL="dir_b7463c83c41dae53927c12ce5c5c2e58.html"];
  }
  }
  dir_97afc8111b754cf401b73024f872f45d [shape=box label="SDKInterfaces" fillcolor="white" style="filled" color="red" URL="dir_97afc8111b754cf401b73024f872f45d.html"];
  dir_49dd3d9ac5586189aa170bac46425b9c [shape=box label="Utils" fillcolor="white" style="filled" color="red" URL="dir_49dd3d9ac5586189aa170bac46425b9c.html"];
  dir_16fdf1dd5a4e411cf30486cba4ef2640->dir_49dd3d9ac5586189aa170bac46425b9c [headlabel="9", labeldistance=1.5 headhref="dir_000047_000061.html"];
  dir_97afc8111b754cf401b73024f872f45d->dir_49dd3d9ac5586189aa170bac46425b9c [headlabel="13", labeldistance=1.5 headhref="dir_000016_000061.html"];
  dir_97afc8111b754cf401b73024f872f45d->dir_b7463c83c41dae53927c12ce5c5c2e58 [headlabel="1", labeldistance=1.5 headhref="dir_000016_000054.html"];
  dir_49dd3d9ac5586189aa170bac46425b9c->dir_16fdf1dd5a4e411cf30486cba4ef2640 [headlabel="8", labeldistance=1.5 headhref="dir_000061_000047.html"];
  dir_49dd3d9ac5586189aa170bac46425b9c->dir_97afc8111b754cf401b73024f872f45d [headlabel="18", labeldistance=1.5 headhref="dir_000061_000016.html"];
  dir_1b86ff6fe19386d1d992f6fa0aca02b2->dir_16fdf1dd5a4e411cf30486cba4ef2640 [headlabel="2", labeldistance=1.5 headhref="dir_000046_000047.html"];
  dir_1b86ff6fe19386d1d992f6fa0aca02b2->dir_97afc8111b754cf401b73024f872f45d [headlabel="18", labeldistance=1.5 headhref="dir_000046_000016.html"];
  dir_7c0f72e3b40394b6419f2d29748370b1->dir_97afc8111b754cf401b73024f872f45d [headlabel="1", labeldistance=1.5 headhref="dir_000048_000016.html"];
  dir_7c0f72e3b40394b6419f2d29748370b1->dir_49dd3d9ac5586189aa170bac46425b9c [headlabel="1", labeldistance=1.5 headhref="dir_000048_000061.html"];
}
