digraph "/workplace/avs-device-sdk/CapabilityAgents/PlaybackController/src/PlaybackController.cpp"
{
  edge [fontname="Helvetica",fontsize="10",labelfontname="Helvetica",labelfontsize="10"];
  node [fontname="Helvetica",fontsize="10",shape=record];
  Node1 [label="/workplace/avs-device\l-sdk/CapabilityAgents\l/PlaybackController/src\l/PlaybackController.cpp",height=0.2,width=0.4,color="black", fillcolor="grey75", style="filled", fontcolor="black"];
  Node1 -> Node2 [color="midnightblue",fontsize="10",style="solid",fontname="Helvetica"];
  Node2 [label="iostream",height=0.2,width=0.4,color="grey75", fillcolor="white", style="filled"];
  Node1 -> Node3 [color="midnightblue",fontsize="10",style="solid",fontname="Helvetica"];
  Node3 [label="PlaybackController\l/PlaybackController.h",height=0.2,width=0.4,color="black", fillcolor="white", style="filled",URL="$_playback_controller_8h.html"];
  Node3 -> Node4 [color="midnightblue",fontsize="10",style="solid",fontname="Helvetica"];
  Node4 [label="memory",height=0.2,width=0.4,color="grey75", fillcolor="white", style="filled"];
  Node3 -> Node5 [color="midnightblue",fontsize="10",style="solid",fontname="Helvetica"];
  Node5 [label="queue",height=0.2,width=0.4,color="grey75", fillcolor="white", style="filled"];
  Node3 -> Node6 [color="midnightblue",fontsize="10",style="solid",fontname="Helvetica"];
  Node6 [label="string",height=0.2,width=0.4,color="grey75", fillcolor="white", style="filled"];
  Node3 -> Node7 [color="midnightblue",fontsize="10",style="solid",fontname="Helvetica"];
  Node7 [label="AVSCommon/AVS/Capability\lConfiguration.h",height=0.2,width=0.4,color="black", fillcolor="white", style="filled",URL="$_capability_configuration_8h.html"];
  Node7 -> Node6 [color="midnightblue",fontsize="10",style="solid",fontname="Helvetica"];
  Node7 -> Node8 [color="midnightblue",fontsize="10",style="solid",fontname="Helvetica"];
  Node8 [label="unordered_map",height=0.2,width=0.4,color="grey75", fillcolor="white", style="filled"];
  Node3 -> Node9 [color="midnightblue",fontsize="10",style="solid",fontname="Helvetica"];
  Node9 [label="AVSCommon/AVS/MessageRequest.h",height=0.2,width=0.4,color="black", fillcolor="white", style="filled",URL="$_message_request_8h.html"];
  Node9 -> Node10 [color="midnightblue",fontsize="10",style="solid",fontname="Helvetica"];
  Node10 [label="cstdlib",height=0.2,width=0.4,color="grey75", fillcolor="white", style="filled"];
  Node9 -> Node4 [color="midnightblue",fontsize="10",style="solid",fontname="Helvetica"];
  Node9 -> Node11 [color="midnightblue",fontsize="10",style="solid",fontname="Helvetica"];
  Node11 [label="mutex",height=0.2,width=0.4,color="grey75", fillcolor="white", style="filled"];
  Node9 -> Node6 [color="midnightblue",fontsize="10",style="solid",fontname="Helvetica"];
  Node9 -> Node12 [color="midnightblue",fontsize="10",style="solid",fontname="Helvetica"];
  Node12 [label="unordered_set",height=0.2,width=0.4,color="grey75", fillcolor="white", style="filled"];
  Node9 -> Node13 [color="midnightblue",fontsize="10",style="solid",fontname="Helvetica"];
  Node13 [label="vector",height=0.2,width=0.4,color="grey75", fillcolor="white", style="filled"];
  Node9 -> Node14 [color="midnightblue",fontsize="10",style="solid",fontname="Helvetica"];
  Node14 [label="AVSCommon/AVS/Attachment\l/AttachmentReader.h",height=0.2,width=0.4,color="black", fillcolor="white", style="filled",URL="$_attachment_reader_8h.html"];
  Node14 -> Node15 [color="midnightblue",fontsize="10",style="solid",fontname="Helvetica"];
  Node15 [label="chrono",height=0.2,width=0.4,color="grey75", fillcolor="white", style="filled"];
  Node14 -> Node16 [color="midnightblue",fontsize="10",style="solid",fontname="Helvetica"];
  Node16 [label="cstddef",height=0.2,width=0.4,color="grey75", fillcolor="white", style="filled"];
  Node14 -> Node17 [color="midnightblue",fontsize="10",style="solid",fontname="Helvetica"];
  Node17 [label="ostream",height=0.2,width=0.4,color="grey75", fillcolor="white", style="filled"];
  Node14 -> Node18 [color="midnightblue",fontsize="10",style="solid",fontname="Helvetica"];
  Node18 [label="AVSCommon/Utils/SDS\l/ReaderPolicy.h",height=0.2,width=0.4,color="black", fillcolor="white", style="filled",URL="$_reader_policy_8h.html"];
  Node9 -> Node19 [color="midnightblue",fontsize="10",style="solid",fontname="Helvetica"];
  Node19 [label="AVSCommon/SDKInterfaces\l/MessageRequestObserverInterface.h",height=0.2,width=0.4,color="black", fillcolor="white", style="filled",URL="$_message_request_observer_interface_8h.html"];
  Node19 -> Node2 [color="midnightblue",fontsize="10",style="solid",fontname="Helvetica"];
  Node3 -> Node20 [color="midnightblue",fontsize="10",style="solid",fontname="Helvetica"];
  Node20 [label="AVSCommon/SDKInterfaces\l/CapabilityConfigurationInterface.h",height=0.2,width=0.4,color="black", fillcolor="white", style="filled",URL="$_capability_configuration_interface_8h.html"];
  Node20 -> Node4 [color="midnightblue",fontsize="10",style="solid",fontname="Helvetica"];
  Node20 -> Node12 [color="midnightblue",fontsize="10",style="solid",fontname="Helvetica"];
  Node20 -> Node7 [color="midnightblue",fontsize="10",style="solid",fontname="Helvetica"];
  Node3 -> Node21 [color="midnightblue",fontsize="10",style="solid",fontname="Helvetica"];
  Node21 [label="AVSCommon/SDKInterfaces\l/ContextManagerInterface.h",height=0.2,width=0.4,color="black", fillcolor="white", style="filled",URL="$_context_manager_interface_8h.html"];
  Node21 -> Node4 [color="midnightblue",fontsize="10",style="solid",fontname="Helvetica"];
  Node21 -> Node22 [color="midnightblue",fontsize="10",style="solid",fontname="Helvetica"];
  Node22 [label="AVSCommon/SDKInterfaces\l/ContextRequesterInterface.h",height=0.2,width=0.4,color="black", fillcolor="white", style="filled",URL="$_context_requester_interface_8h.html"];
  Node22 -> Node6 [color="midnightblue",fontsize="10",style="solid",fontname="Helvetica"];
  Node22 -> Node17 [color="midnightblue",fontsize="10",style="solid",fontname="Helvetica"];
  Node21 -> Node23 [color="midnightblue",fontsize="10",style="solid",fontname="Helvetica"];
  Node23 [label="AVSCommon/SDKInterfaces\l/StateProviderInterface.h",height=0.2,width=0.4,color="black", fillcolor="white", style="filled",URL="$_state_provider_interface_8h.html"];
  Node23 -> Node24 [color="midnightblue",fontsize="10",style="solid",fontname="Helvetica"];
  Node24 [label="AVSCommon/AVS/NamespaceAnd\lName.h",height=0.2,width=0.4,color="black", fillcolor="white", style="filled",URL="$_namespace_and_name_8h.html"];
  Node24 -> Node6 [color="midnightblue",fontsize="10",style="solid",fontname="Helvetica"];
  Node21 -> Node25 [color="midnightblue",fontsize="10",style="solid",fontname="Helvetica"];
  Node25 [label="AVSCommon/AVS/StateRefresh\lPolicy.h",height=0.2,width=0.4,color="black", fillcolor="white", style="filled",URL="$_state_refresh_policy_8h.html"];
  Node21 -> Node24 [color="midnightblue",fontsize="10",style="solid",fontname="Helvetica"];
  Node3 -> Node22 [color="midnightblue",fontsize="10",style="solid",fontname="Helvetica"];
  Node3 -> Node26 [color="midnightblue",fontsize="10",style="solid",fontname="Helvetica"];
  Node26 [label="AVSCommon/SDKInterfaces\l/MessageSenderInterface.h",height=0.2,width=0.4,color="black", fillcolor="white", style="filled",URL="$_message_sender_interface_8h.html"];
  Node26 -> Node9 [color="midnightblue",fontsize="10",style="solid",fontname="Helvetica"];
  Node3 -> Node27 [color="midnightblue",fontsize="10",style="solid",fontname="Helvetica"];
  Node27 [label="AVSCommon/SDKInterfaces\l/PlaybackHandlerInterface.h",height=0.2,width=0.4,color="black", fillcolor="white", style="filled",URL="$_playback_handler_interface_8h.html"];
  Node27 -> Node28 [color="midnightblue",fontsize="10",style="solid",fontname="Helvetica"];
  Node28 [label="AVSCommon/AVS/PlaybackButtons.h",height=0.2,width=0.4,color="black", fillcolor="white", style="filled",URL="$_playback_buttons_8h.html"];
  Node28 -> Node2 [color="midnightblue",fontsize="10",style="solid",fontname="Helvetica"];
  Node3 -> Node29 [color="midnightblue",fontsize="10",style="solid",fontname="Helvetica"];
  Node29 [label="AVSCommon/Utils/Requires\lShutdown.h",height=0.2,width=0.4,color="black", fillcolor="white", style="filled",URL="$_requires_shutdown_8h.html"];
  Node29 -> Node30 [color="midnightblue",fontsize="10",style="solid",fontname="Helvetica"];
  Node30 [label="atomic",height=0.2,width=0.4,color="grey75", fillcolor="white", style="filled"];
  Node29 -> Node4 [color="midnightblue",fontsize="10",style="solid",fontname="Helvetica"];
  Node29 -> Node11 [color="midnightblue",fontsize="10",style="solid",fontname="Helvetica"];
  Node29 -> Node6 [color="midnightblue",fontsize="10",style="solid",fontname="Helvetica"];
  Node3 -> Node31 [color="midnightblue",fontsize="10",style="solid",fontname="Helvetica"];
  Node31 [label="AVSCommon/Utils/Threading\l/Executor.h",height=0.2,width=0.4,color="black", fillcolor="white", style="filled",URL="$_executor_8h.html"];
  Node31 -> Node30 [color="midnightblue",fontsize="10",style="solid",fontname="Helvetica"];
  Node31 -> Node32 [color="midnightblue",fontsize="10",style="solid",fontname="Helvetica"];
  Node32 [label="condition_variable",height=0.2,width=0.4,color="grey75", fillcolor="white", style="filled"];
  Node31 -> Node15 [color="midnightblue",fontsize="10",style="solid",fontname="Helvetica"];
  Node31 -> Node33 [color="midnightblue",fontsize="10",style="solid",fontname="Helvetica"];
  Node33 [label="deque",height=0.2,width=0.4,color="grey75", fillcolor="white", style="filled"];
  Node31 -> Node34 [color="midnightblue",fontsize="10",style="solid",fontname="Helvetica"];
  Node34 [label="functional",height=0.2,width=0.4,color="grey75", fillcolor="white", style="filled"];
  Node31 -> Node35 [color="midnightblue",fontsize="10",style="solid",fontname="Helvetica"];
  Node35 [label="future",height=0.2,width=0.4,color="grey75", fillcolor="white", style="filled"];
  Node31 -> Node4 [color="midnightblue",fontsize="10",style="solid",fontname="Helvetica"];
  Node31 -> Node11 [color="midnightblue",fontsize="10",style="solid",fontname="Helvetica"];
  Node31 -> Node36 [color="midnightblue",fontsize="10",style="solid",fontname="Helvetica"];
  Node36 [label="utility",height=0.2,width=0.4,color="grey75", fillcolor="white", style="filled"];
  Node31 -> Node37 [color="midnightblue",fontsize="10",style="solid",fontname="Helvetica"];
  Node37 [label="AVSCommon/Utils/Threading\l/TaskThread.h",height=0.2,width=0.4,color="black", fillcolor="white", style="filled",URL="$_task_thread_8h.html"];
  Node37 -> Node30 [color="midnightblue",fontsize="10",style="solid",fontname="Helvetica"];
  Node37 -> Node34 [color="midnightblue",fontsize="10",style="solid",fontname="Helvetica"];
  Node37 -> Node6 [color="midnightblue",fontsize="10",style="solid",fontname="Helvetica"];
  Node37 -> Node38 [color="midnightblue",fontsize="10",style="solid",fontname="Helvetica"];
  Node38 [label="thread",height=0.2,width=0.4,color="grey75", fillcolor="white", style="filled"];
  Node3 -> Node39 [color="midnightblue",fontsize="10",style="solid",fontname="Helvetica"];
  Node39 [label="PlaybackCommand.h",height=0.2,width=0.4,color="black", fillcolor="white", style="filled",URL="$_playback_command_8h.html"];
  Node39 -> Node6 [color="midnightblue",fontsize="10",style="solid",fontname="Helvetica"];
  Node39 -> Node17 [color="midnightblue",fontsize="10",style="solid",fontname="Helvetica"];
  Node39 -> Node28 [color="midnightblue",fontsize="10",style="solid",fontname="Helvetica"];
  Node1 -> Node40 [color="midnightblue",fontsize="10",style="solid",fontname="Helvetica"];
  Node40 [label="PlaybackController\l/PlaybackMessageRequest.h",height=0.2,width=0.4,color="black", fillcolor="white", style="filled",URL="$_playback_message_request_8h.html"];
  Node40 -> Node9 [color="midnightblue",fontsize="10",style="solid",fontname="Helvetica"];
  Node40 -> Node19 [color="midnightblue",fontsize="10",style="solid",fontname="Helvetica"];
  Node40 -> Node3 [color="midnightblue",fontsize="10",style="solid",fontname="Helvetica"];
  Node40 -> Node39 [color="midnightblue",fontsize="10",style="solid",fontname="Helvetica"];
  Node1 -> Node7 [color="midnightblue",fontsize="10",style="solid",fontname="Helvetica"];
  Node1 -> Node41 [color="midnightblue",fontsize="10",style="solid",fontname="Helvetica"];
  Node41 [label="AVSCommon/AVS/EventBuilder.h",height=0.2,width=0.4,color="black", fillcolor="white", style="filled",URL="$_event_builder_8h.html"];
  Node41 -> Node6 [color="midnightblue",fontsize="10",style="solid",fontname="Helvetica"];
  Node41 -> Node36 [color="midnightblue",fontsize="10",style="solid",fontname="Helvetica"];
  Node1 -> Node42 [color="midnightblue",fontsize="10",style="solid",fontname="Helvetica"];
  Node42 [label="AVSCommon/Utils/Logger\l/Logger.h",height=0.2,width=0.4,color="black", fillcolor="white", style="filled",URL="$_logger_8h.html"];
  Node42 -> Node30 [color="midnightblue",fontsize="10",style="solid",fontname="Helvetica"];
  Node42 -> Node15 [color="midnightblue",fontsize="10",style="solid",fontname="Helvetica"];
  Node42 -> Node11 [color="midnightblue",fontsize="10",style="solid",fontname="Helvetica"];
  Node42 -> Node43 [color="midnightblue",fontsize="10",style="solid",fontname="Helvetica"];
  Node43 [label="sstream",height=0.2,width=0.4,color="grey75", fillcolor="white", style="filled"];
  Node42 -> Node13 [color="midnightblue",fontsize="10",style="solid",fontname="Helvetica"];
  Node42 -> Node44 [color="midnightblue",fontsize="10",style="solid",fontname="Helvetica"];
  Node44 [label="AVSCommon/Utils/Configuration\l/ConfigurationNode.h",height=0.2,width=0.4,color="black", fillcolor="white", style="filled",URL="$_configuration_node_8h.html"];
  Node44 -> Node15 [color="midnightblue",fontsize="10",style="solid",fontname="Helvetica"];
  Node44 -> Node2 [color="midnightblue",fontsize="10",style="solid",fontname="Helvetica"];
  Node44 -> Node4 [color="midnightblue",fontsize="10",style="solid",fontname="Helvetica"];
  Node44 -> Node11 [color="midnightblue",fontsize="10",style="solid",fontname="Helvetica"];
  Node44 -> Node6 [color="midnightblue",fontsize="10",style="solid",fontname="Helvetica"];
  Node44 -> Node13 [color="midnightblue",fontsize="10",style="solid",fontname="Helvetica"];
  Node44 -> Node45 [color="midnightblue",fontsize="10",style="solid",fontname="Helvetica"];
  Node45 [label="rapidjson/document.h",height=0.2,width=0.4,color="grey75", fillcolor="white", style="filled"];
  Node42 -> Node46 [color="midnightblue",fontsize="10",style="solid",fontname="Helvetica"];
  Node46 [label="AVSCommon/Utils/Logger\l/Level.h",height=0.2,width=0.4,color="black", fillcolor="white", style="filled",URL="$_level_8h.html"];
  Node46 -> Node6 [color="midnightblue",fontsize="10",style="solid",fontname="Helvetica"];
  Node42 -> Node47 [color="midnightblue",fontsize="10",style="solid",fontname="Helvetica"];
  Node47 [label="AVSCommon/Utils/Logger\l/LogEntry.h",height=0.2,width=0.4,color="black", fillcolor="white", style="filled",URL="$_log_entry_8h.html"];
  Node47 -> Node43 [color="midnightblue",fontsize="10",style="solid",fontname="Helvetica"];
  Node47 -> Node6 [color="midnightblue",fontsize="10",style="solid",fontname="Helvetica"];
  Node47 -> Node48 [color="midnightblue",fontsize="10",style="solid",fontname="Helvetica"];
  Node48 [label="AVSCommon/Utils/Logger\l/LogEntryStream.h",height=0.2,width=0.4,color="red", fillcolor="white", style="filled",URL="$_log_entry_stream_8h.html"];
  Node48 -> Node17 [color="midnightblue",fontsize="10",style="solid",fontname="Helvetica"];
  Node42 -> Node49 [color="midnightblue",fontsize="10",style="solid",fontname="Helvetica"];
  Node49 [label="AVSCommon/Utils/Logger\l/LogLevelObserverInterface.h",height=0.2,width=0.4,color="black", fillcolor="white", style="filled",URL="$_log_level_observer_interface_8h.html"];
  Node49 -> Node46 [color="midnightblue",fontsize="10",style="solid",fontname="Helvetica"];
  Node42 -> Node50 [color="midnightblue",fontsize="10",style="solid",fontname="Helvetica"];
  Node50 [label="AVSCommon/Utils/Logger\l/SinkObserverInterface.h",height=0.2,width=0.4,color="black", fillcolor="white", style="filled",URL="$_sink_observer_interface_8h.html"];
  Node50 -> Node4 [color="midnightblue",fontsize="10",style="solid",fontname="Helvetica"];
}
