digraph "/workplace/avs-device-sdk/AVSCommon/Utils/test/AVSCommon/Utils/HTTP2/MockHTTP2MimeResponseDecodeSink.h"
{
  edge [fontname="Helvetica",fontsize="10",labelfontname="Helvetica",labelfontsize="10"];
  node [fontname="Helvetica",fontsize="10",shape=record];
  Node1 [label="/workplace/avs-device\l-sdk/AVSCommon/Utils\l/test/AVSCommon/Utils\l/HTTP2/MockHTTP2MimeResponseDecode\lSink.h",height=0.2,width=0.4,color="black", fillcolor="grey75", style="filled", fontcolor="black"];
  Node1 -> Node2 [dir="back",color="midnightblue",fontsize="10",style="solid",fontname="Helvetica"];
  Node2 [label="/workplace/avs-device\l-sdk/AVSCommon/Utils\l/test/Common/MockHTTP2MimeResponse\lDecodeSink.cpp",height=0.2,width=0.4,color="black", fillcolor="white", style="filled",URL="$_mock_h_t_t_p2_mime_response_decode_sink_8cpp.html"];
  Node1 -> Node3 [dir="back",color="midnightblue",fontsize="10",style="solid",fontname="Helvetica"];
  Node3 [label="/workplace/avs-device\l-sdk/AVSCommon/Utils\l/test/MIMEParserTest.cpp",height=0.2,width=0.4,color="black", fillcolor="white", style="filled",URL="$_m_i_m_e_parser_test_8cpp.html"];
}
