digraph "/workplace/avs-device-sdk/AVSCommon/SDKInterfaces/include/AVSCommon/SDKInterfaces/AVSConnectionManagerInterface.h"
{
  edge [fontname="Helvetica",fontsize="10",labelfontname="Helvetica",labelfontsize="10"];
  node [fontname="Helvetica",fontsize="10",shape=record];
  Node1 [label="/workplace/avs-device\l-sdk/AVSCommon/SDKInterfaces\l/include/AVSCommon/SDKInterfaces\l/AVSConnectionManagerInterface.h",height=0.2,width=0.4,color="black", fillcolor="grey75", style="filled", fontcolor="black"];
  Node1 -> Node2 [dir="back",color="midnightblue",fontsize="10",style="solid",fontname="Helvetica"];
  Node2 [label="/workplace/avs-device\l-sdk/AVSCommon/AVS/include\l/AVSCommon/AVS/AbstractAVSConnection\lManager.h",height=0.2,width=0.4,color="black", fillcolor="white", style="filled",URL="$_abstract_a_v_s_connection_manager_8h.html"];
  Node2 -> Node3 [dir="back",color="midnightblue",fontsize="10",style="solid",fontname="Helvetica"];
  Node3 [label="/workplace/avs-device\l-sdk/ACL/include/ACL\l/AVSConnectionManager.h",height=0.2,width=0.4,color="black", fillcolor="white", style="filled",URL="$_a_v_s_connection_manager_8h.html"];
  Node3 -> Node4 [dir="back",color="midnightblue",fontsize="10",style="solid",fontname="Helvetica"];
  Node4 [label="/workplace/avs-device\l-sdk/ACL/src/AVSConnectionManager.cpp",height=0.2,width=0.4,color="black", fillcolor="white", style="filled",URL="$_a_v_s_connection_manager_8cpp.html"];
  Node3 -> Node5 [dir="back",color="midnightblue",fontsize="10",style="solid",fontname="Helvetica"];
  Node5 [label="/workplace/avs-device\l-sdk/ACL/test/AVSConnection\lManagerTest.cpp",height=0.2,width=0.4,color="black", fillcolor="white", style="filled",URL="$_a_v_s_connection_manager_test_8cpp.html"];
  Node3 -> Node6 [dir="back",color="midnightblue",fontsize="10",style="solid",fontname="Helvetica"];
  Node6 [label="/workplace/avs-device\l-sdk/ApplicationUtilities\l/DefaultClient/include/DefaultClient\l/DefaultClient.h",height=0.2,width=0.4,color="black", fillcolor="white", style="filled",URL="$_default_client_8h.html"];
  Node6 -> Node7 [dir="back",color="midnightblue",fontsize="10",style="solid",fontname="Helvetica"];
  Node7 [label="/workplace/avs-device\l-sdk/ApplicationUtilities\l/DefaultClient/src/DefaultClient.cpp",height=0.2,width=0.4,color="black", fillcolor="white", style="filled",URL="$_default_client_8cpp.html"];
  Node6 -> Node8 [dir="back",color="midnightblue",fontsize="10",style="solid",fontname="Helvetica"];
  Node8 [label="/workplace/avs-device\l-sdk/SampleApp/include\l/SampleApp/InteractionManager.h",height=0.2,width=0.4,color="black", fillcolor="white", style="filled",URL="$_interaction_manager_8h.html"];
  Node8 -> Node9 [dir="back",color="midnightblue",fontsize="10",style="solid",fontname="Helvetica"];
  Node9 [label="/workplace/avs-device\l-sdk/SampleApp/include\l/SampleApp/UserInputManager.h",height=0.2,width=0.4,color="black", fillcolor="white", style="filled",URL="$_user_input_manager_8h.html"];
  Node9 -> Node10 [dir="back",color="midnightblue",fontsize="10",style="solid",fontname="Helvetica"];
  Node10 [label="/workplace/avs-device\l-sdk/SampleApp/include\l/SampleApp/SampleApplication.h",height=0.2,width=0.4,color="black", fillcolor="white", style="filled",URL="$_sample_application_8h.html"];
  Node10 -> Node11 [dir="back",color="midnightblue",fontsize="10",style="solid",fontname="Helvetica"];
  Node11 [label="/workplace/avs-device\l-sdk/SampleApp/src/main.cpp",height=0.2,width=0.4,color="black", fillcolor="white", style="filled",URL="$main_8cpp.html"];
  Node10 -> Node12 [dir="back",color="midnightblue",fontsize="10",style="solid",fontname="Helvetica"];
  Node12 [label="/workplace/avs-device\l-sdk/SampleApp/src/SampleApplication.cpp",height=0.2,width=0.4,color="black", fillcolor="white", style="filled",URL="$_sample_application_8cpp.html"];
  Node9 -> Node13 [dir="back",color="midnightblue",fontsize="10",style="solid",fontname="Helvetica"];
  Node13 [label="/workplace/avs-device\l-sdk/SampleApp/src/UserInput\lManager.cpp",height=0.2,width=0.4,color="black", fillcolor="white", style="filled",URL="$_user_input_manager_8cpp.html"];
  Node8 -> Node14 [dir="back",color="midnightblue",fontsize="10",style="solid",fontname="Helvetica"];
  Node14 [label="/workplace/avs-device\l-sdk/SampleApp/src/Interaction\lManager.cpp",height=0.2,width=0.4,color="black", fillcolor="white", style="filled",URL="$_interaction_manager_8cpp.html"];
  Node6 -> Node15 [dir="back",color="midnightblue",fontsize="10",style="solid",fontname="Helvetica"];
  Node15 [label="/workplace/avs-device\l-sdk/SampleApp/include\l/SampleApp/KeywordObserver.h",height=0.2,width=0.4,color="black", fillcolor="white", style="filled",URL="$_keyword_observer_8h.html"];
  Node15 -> Node8 [dir="back",color="midnightblue",fontsize="10",style="solid",fontname="Helvetica"];
  Node15 -> Node16 [dir="back",color="midnightblue",fontsize="10",style="solid",fontname="Helvetica"];
  Node16 [label="/workplace/avs-device\l-sdk/SampleApp/src/KeywordObserver.cpp",height=0.2,width=0.4,color="black", fillcolor="white", style="filled",URL="$_keyword_observer_8cpp.html"];
  Node15 -> Node12 [dir="back",color="midnightblue",fontsize="10",style="solid",fontname="Helvetica"];
  Node3 -> Node17 [dir="back",color="midnightblue",fontsize="10",style="solid",fontname="Helvetica"];
  Node17 [label="/workplace/avs-device\l-sdk/CapabilityAgents\l/System/include/System\l/SoftwareInfoSender.h",height=0.2,width=0.4,color="black", fillcolor="white", style="filled",URL="$_software_info_sender_8h.html"];
  Node17 -> Node6 [dir="back",color="midnightblue",fontsize="10",style="solid",fontname="Helvetica"];
  Node17 -> Node18 [dir="back",color="midnightblue",fontsize="10",style="solid",fontname="Helvetica"];
  Node18 [label="/workplace/avs-device\l-sdk/CapabilityAgents\l/System/include/System\l/SoftwareInfoSendRequest.h",height=0.2,width=0.4,color="black", fillcolor="white", style="filled",URL="$_software_info_send_request_8h.html"];
  Node18 -> Node19 [dir="back",color="midnightblue",fontsize="10",style="solid",fontname="Helvetica"];
  Node19 [label="/workplace/avs-device\l-sdk/CapabilityAgents\l/System/src/SoftwareInfoSender.cpp",height=0.2,width=0.4,color="black", fillcolor="white", style="filled",URL="$_software_info_sender_8cpp.html"];
  Node18 -> Node20 [dir="back",color="midnightblue",fontsize="10",style="solid",fontname="Helvetica"];
  Node20 [label="/workplace/avs-device\l-sdk/CapabilityAgents\l/System/src/SoftwareInfoSend\lRequest.cpp",height=0.2,width=0.4,color="black", fillcolor="white", style="filled",URL="$_software_info_send_request_8cpp.html"];
  Node17 -> Node19 [dir="back",color="midnightblue",fontsize="10",style="solid",fontname="Helvetica"];
  Node17 -> Node20 [dir="back",color="midnightblue",fontsize="10",style="solid",fontname="Helvetica"];
  Node17 -> Node21 [dir="back",color="midnightblue",fontsize="10",style="solid",fontname="Helvetica"];
  Node21 [label="/workplace/avs-device\l-sdk/CapabilityAgents\l/System/test/SoftwareInfoTest.cpp",height=0.2,width=0.4,color="black", fillcolor="white", style="filled",URL="$_software_info_test_8cpp.html"];
  Node3 -> Node22 [dir="back",color="midnightblue",fontsize="10",style="solid",fontname="Helvetica"];
  Node22 [label="/workplace/avs-device\l-sdk/Integration/include\l/Integration/TestMessageSender.h",height=0.2,width=0.4,color="black", fillcolor="white", style="filled",URL="$_test_message_sender_8h.html"];
  Node22 -> Node23 [dir="back",color="midnightblue",fontsize="10",style="solid",fontname="Helvetica"];
  Node23 [label="/workplace/avs-device\l-sdk/Integration/src\l/TestMessageSender.cpp",height=0.2,width=0.4,color="black", fillcolor="white", style="filled",URL="$_test_message_sender_8cpp.html"];
  Node22 -> Node24 [dir="back",color="midnightblue",fontsize="10",style="solid",fontname="Helvetica"];
  Node24 [label="/workplace/avs-device\l-sdk/Integration/test\l/AlertsIntegrationTest.cpp",height=0.2,width=0.4,color="black", fillcolor="white", style="filled",URL="$_alerts_integration_test_8cpp.html"];
  Node22 -> Node25 [dir="back",color="midnightblue",fontsize="10",style="solid",fontname="Helvetica"];
  Node25 [label="/workplace/avs-device\l-sdk/Integration/test\l/AudioInputProcessorIntegration\lTest.cpp",height=0.2,width=0.4,color="black", fillcolor="white", style="filled",URL="$_audio_input_processor_integration_test_8cpp.html"];
  Node22 -> Node26 [dir="back",color="midnightblue",fontsize="10",style="solid",fontname="Helvetica"];
  Node26 [label="/workplace/avs-device\l-sdk/Integration/test\l/AudioPlayerIntegrationTest.cpp",height=0.2,width=0.4,color="black", fillcolor="white", style="filled",URL="$_audio_player_integration_test_8cpp.html"];
  Node22 -> Node27 [dir="back",color="midnightblue",fontsize="10",style="solid",fontname="Helvetica"];
  Node27 [label="/workplace/avs-device\l-sdk/Integration/test\l/SpeechSynthesizerIntegration\lTest.cpp",height=0.2,width=0.4,color="black", fillcolor="white", style="filled",URL="$_speech_synthesizer_integration_test_8cpp.html"];
  Node3 -> Node23 [dir="back",color="midnightblue",fontsize="10",style="solid",fontname="Helvetica"];
  Node3 -> Node28 [dir="back",color="midnightblue",fontsize="10",style="solid",fontname="Helvetica"];
  Node28 [label="/workplace/avs-device\l-sdk/Integration/test\l/AlexaCommunicationsLibraryTest.cpp",height=0.2,width=0.4,color="black", fillcolor="white", style="filled",URL="$_alexa_communications_library_test_8cpp.html"];
  Node3 -> Node29 [dir="back",color="midnightblue",fontsize="10",style="solid",fontname="Helvetica"];
  Node29 [label="/workplace/avs-device\l-sdk/Integration/test\l/AlexaDirectiveSequencerLibrary\lTest.cpp",height=0.2,width=0.4,color="black", fillcolor="white", style="filled",URL="$_alexa_directive_sequencer_library_test_8cpp.html"];
  Node3 -> Node25 [dir="back",color="midnightblue",fontsize="10",style="solid",fontname="Helvetica"];
  Node3 -> Node30 [dir="back",color="midnightblue",fontsize="10",style="solid",fontname="Helvetica"];
  Node30 [label="/workplace/avs-device\l-sdk/Integration/test\l/NetworkIntegrationTests.cpp",height=0.2,width=0.4,color="black", fillcolor="white", style="filled",URL="$_network_integration_tests_8cpp.html"];
  Node3 -> Node31 [dir="back",color="midnightblue",fontsize="10",style="solid",fontname="Helvetica"];
  Node31 [label="/workplace/avs-device\l-sdk/Integration/test\l/ServerDisconnectIntegration\lTest.cpp",height=0.2,width=0.4,color="black", fillcolor="white", style="filled",URL="$_server_disconnect_integration_test_8cpp.html"];
  Node2 -> Node32 [dir="back",color="midnightblue",fontsize="10",style="solid",fontname="Helvetica"];
  Node32 [label="/workplace/avs-device\l-sdk/AVSCommon/AVS/src\l/AbstractAVSConnectionManager.cpp",height=0.2,width=0.4,color="black", fillcolor="white", style="filled",URL="$_abstract_a_v_s_connection_manager_8cpp.html"];
  Node2 -> Node33 [dir="back",color="midnightblue",fontsize="10",style="solid",fontname="Helvetica"];
  Node33 [label="/workplace/avs-device\l-sdk/CapabilityAgents\l/Settings/test/SettingsTest.cpp",height=0.2,width=0.4,color="black", fillcolor="white", style="filled",URL="$_settings_test_8cpp.html"];
  Node2 -> Node21 [dir="back",color="midnightblue",fontsize="10",style="solid",fontname="Helvetica"];
  Node2 -> Node34 [dir="back",color="midnightblue",fontsize="10",style="solid",fontname="Helvetica"];
  Node34 [label="/workplace/avs-device\l-sdk/CertifiedSender\l/test/CertifiedSenderTest.cpp",height=0.2,width=0.4,color="black", fillcolor="white", style="filled",URL="$_certified_sender_test_8cpp.html"];
  Node1 -> Node35 [dir="back",color="midnightblue",fontsize="10",style="solid",fontname="Helvetica"];
  Node35 [label="/workplace/avs-device\l-sdk/AVSCommon/SDKInterfaces\l/test/AVSCommon/SDKInterfaces\l/MockAVSConnectionManager.h",height=0.2,width=0.4,color="black", fillcolor="white", style="filled",URL="$_mock_a_v_s_connection_manager_8h.html"];
  Node35 -> Node36 [dir="back",color="midnightblue",fontsize="10",style="solid",fontname="Helvetica"];
  Node36 [label="/workplace/avs-device\l-sdk/CapabilityAgents\l/Alerts/test/AlertsCapability\lAgentTest.cpp",height=0.2,width=0.4,color="black", fillcolor="white", style="filled",URL="$_alerts_capability_agent_test_8cpp.html"];
  Node35 -> Node37 [dir="back",color="midnightblue",fontsize="10",style="solid",fontname="Helvetica"];
  Node37 [label="/workplace/avs-device\l-sdk/CertifiedSender\l/test/MockCertifiedSender.h",height=0.2,width=0.4,color="black", fillcolor="white", style="filled",URL="$_mock_certified_sender_8h.html"];
  Node37 -> Node38 [dir="back",color="midnightblue",fontsize="10",style="solid",fontname="Helvetica"];
  Node38 [label="/workplace/avs-device\l-sdk/CertifiedSender\l/test/Common/MockCertifiedSender.cpp",height=0.2,width=0.4,color="black", fillcolor="white", style="filled",URL="$_mock_certified_sender_8cpp.html"];
  Node35 -> Node39 [dir="back",color="midnightblue",fontsize="10",style="solid",fontname="Helvetica"];
  Node39 [label="/workplace/avs-device\l-sdk/RegistrationManager\l/test/RegistrationManagerTest.cpp",height=0.2,width=0.4,color="black", fillcolor="white", style="filled",URL="$_registration_manager_test_8cpp.html"];
  Node1 -> Node17 [dir="back",color="midnightblue",fontsize="10",style="solid",fontname="Helvetica"];
  Node1 -> Node40 [dir="back",color="midnightblue",fontsize="10",style="solid",fontname="Helvetica"];
  Node40 [label="/workplace/avs-device\l-sdk/CertifiedSender\l/include/CertifiedSender\l/CertifiedSender.h",height=0.2,width=0.4,color="black", fillcolor="white", style="filled",URL="$_certified_sender_8h.html"];
  Node40 -> Node6 [dir="back",color="midnightblue",fontsize="10",style="solid",fontname="Helvetica"];
  Node40 -> Node41 [dir="back",color="midnightblue",fontsize="10",style="solid",fontname="Helvetica"];
  Node41 [label="/workplace/avs-device\l-sdk/CapabilityAgents\l/Alerts/include/Alerts\l/AlertsCapabilityAgent.h",height=0.2,width=0.4,color="black", fillcolor="white", style="filled",URL="$_alerts_capability_agent_8h.html"];
  Node41 -> Node6 [dir="back",color="midnightblue",fontsize="10",style="solid",fontname="Helvetica"];
  Node41 -> Node42 [dir="back",color="midnightblue",fontsize="10",style="solid",fontname="Helvetica"];
  Node42 [label="/workplace/avs-device\l-sdk/CapabilityAgents\l/Alerts/src/AlertsCapability\lAgent.cpp",height=0.2,width=0.4,color="black", fillcolor="white", style="filled",URL="$_alerts_capability_agent_8cpp.html"];
  Node41 -> Node36 [dir="back",color="midnightblue",fontsize="10",style="solid",fontname="Helvetica"];
  Node41 -> Node24 [dir="back",color="midnightblue",fontsize="10",style="solid",fontname="Helvetica"];
  Node40 -> Node43 [dir="back",color="midnightblue",fontsize="10",style="solid",fontname="Helvetica"];
  Node43 [label="/workplace/avs-device\l-sdk/CapabilityAgents\l/Settings/include/Settings\l/SettingsUpdatedEventSender.h",height=0.2,width=0.4,color="black", fillcolor="white", style="filled",URL="$_settings_updated_event_sender_8h.html"];
  Node43 -> Node6 [dir="back",color="midnightblue",fontsize="10",style="solid",fontname="Helvetica"];
  Node43 -> Node7 [dir="back",color="midnightblue",fontsize="10",style="solid",fontname="Helvetica"];
  Node43 -> Node44 [dir="back",color="midnightblue",fontsize="10",style="solid",fontname="Helvetica"];
  Node44 [label="/workplace/avs-device\l-sdk/CapabilityAgents\l/Settings/src/SettingsUpdated\lEventSender.cpp",height=0.2,width=0.4,color="black", fillcolor="white", style="filled",URL="$_settings_updated_event_sender_8cpp.html"];
  Node43 -> Node33 [dir="back",color="midnightblue",fontsize="10",style="solid",fontname="Helvetica"];
  Node40 -> Node33 [dir="back",color="midnightblue",fontsize="10",style="solid",fontname="Helvetica"];
  Node40 -> Node45 [dir="back",color="midnightblue",fontsize="10",style="solid",fontname="Helvetica"];
  Node45 [label="/workplace/avs-device\l-sdk/CertifiedSender\l/src/CertifiedSender.cpp",height=0.2,width=0.4,color="black", fillcolor="white", style="filled",URL="$_certified_sender_8cpp.html"];
  Node40 -> Node34 [dir="back",color="midnightblue",fontsize="10",style="solid",fontname="Helvetica"];
  Node40 -> Node37 [dir="back",color="midnightblue",fontsize="10",style="solid",fontname="Helvetica"];
  Node40 -> Node24 [dir="back",color="midnightblue",fontsize="10",style="solid",fontname="Helvetica"];
  Node1 -> Node46 [dir="back",color="midnightblue",fontsize="10",style="solid",fontname="Helvetica"];
  Node46 [label="/workplace/avs-device\l-sdk/RegistrationManager\l/include/RegistrationManager\l/RegistrationManager.h",height=0.2,width=0.4,color="black", fillcolor="white", style="filled",URL="$_registration_manager_8h.html"];
  Node46 -> Node6 [dir="back",color="midnightblue",fontsize="10",style="solid",fontname="Helvetica"];
  Node46 -> Node47 [dir="back",color="midnightblue",fontsize="10",style="solid",fontname="Helvetica"];
  Node47 [label="/workplace/avs-device\l-sdk/RegistrationManager\l/src/RegistrationManager.cpp",height=0.2,width=0.4,color="black", fillcolor="white", style="filled",URL="$_registration_manager_8cpp.html"];
  Node46 -> Node39 [dir="back",color="midnightblue",fontsize="10",style="solid",fontname="Helvetica"];
  Node46 -> Node48 [dir="back",color="midnightblue",fontsize="10",style="solid",fontname="Helvetica"];
  Node48 [label="/workplace/avs-device\l-sdk/SampleApp/include\l/SampleApp/RevokeAuthorization\lObserver.h",height=0.2,width=0.4,color="black", fillcolor="white", style="filled",URL="$_revoke_authorization_observer_8h.html"];
  Node48 -> Node49 [dir="back",color="midnightblue",fontsize="10",style="solid",fontname="Helvetica"];
  Node49 [label="/workplace/avs-device\l-sdk/SampleApp/src/RevokeAuthorization\lObserver.cpp",height=0.2,width=0.4,color="black", fillcolor="white", style="filled",URL="$_revoke_authorization_observer_8cpp.html"];
}
