digraph "/workplace/avs-device-sdk/SampleApp/src/KeywordObserver.cpp"
{
  edge [fontname="Helvetica",fontsize="10",labelfontname="Helvetica",labelfontsize="10"];
  node [fontname="Helvetica",fontsize="10",shape=record];
  Node1 [label="/workplace/avs-device\l-sdk/SampleApp/src/KeywordObserver.cpp",height=0.2,width=0.4,color="black", fillcolor="grey75", style="filled", fontcolor="black"];
  Node1 -> Node2 [color="midnightblue",fontsize="10",style="solid",fontname="Helvetica"];
  Node2 [label="SampleApp/KeywordObserver.h",height=0.2,width=0.4,color="black", fillcolor="white", style="filled",URL="$_keyword_observer_8h.html"];
  Node2 -> Node3 [color="midnightblue",fontsize="10",style="solid",fontname="Helvetica"];
  Node3 [label="memory",height=0.2,width=0.4,color="grey75", fillcolor="white", style="filled"];
  Node2 -> Node4 [color="midnightblue",fontsize="10",style="solid",fontname="Helvetica"];
  Node4 [label="string",height=0.2,width=0.4,color="grey75", fillcolor="white", style="filled"];
  Node2 -> Node5 [color="midnightblue",fontsize="10",style="solid",fontname="Helvetica"];
  Node5 [label="AVSCommon/AVS/AudioInput\lStream.h",height=0.2,width=0.4,color="black", fillcolor="white", style="filled",URL="$_audio_input_stream_8h.html"];
  Node5 -> Node6 [color="midnightblue",fontsize="10",style="solid",fontname="Helvetica"];
  Node6 [label="AVSCommon/Utils/SDS\l/InProcessSDS.h",height=0.2,width=0.4,color="red", fillcolor="white", style="filled",URL="$_in_process_s_d_s_8h.html"];
  Node6 -> Node7 [color="midnightblue",fontsize="10",style="solid",fontname="Helvetica"];
  Node7 [label="vector",height=0.2,width=0.4,color="grey75", fillcolor="white", style="filled"];
  Node6 -> Node4 [color="midnightblue",fontsize="10",style="solid",fontname="Helvetica"];
  Node2 -> Node8 [color="midnightblue",fontsize="10",style="solid",fontname="Helvetica"];
  Node8 [label="AVSCommon/SDKInterfaces\l/KeyWordObserverInterface.h",height=0.2,width=0.4,color="black", fillcolor="white", style="filled",URL="$_key_word_observer_interface_8h.html"];
  Node8 -> Node9 [color="midnightblue",fontsize="10",style="solid",fontname="Helvetica"];
  Node9 [label="limits",height=0.2,width=0.4,color="grey75", fillcolor="white", style="filled"];
  Node8 -> Node3 [color="midnightblue",fontsize="10",style="solid",fontname="Helvetica"];
  Node8 -> Node7 [color="midnightblue",fontsize="10",style="solid",fontname="Helvetica"];
  Node8 -> Node5 [color="midnightblue",fontsize="10",style="solid",fontname="Helvetica"];
  Node2 -> Node10 [color="midnightblue",fontsize="10",style="solid",fontname="Helvetica"];
  Node10 [label="DefaultClient/DefaultClient.h",height=0.2,width=0.4,color="red", fillcolor="white", style="filled",URL="$_default_client_8h.html"];
  Node10 -> Node11 [color="midnightblue",fontsize="10",style="solid",fontname="Helvetica"];
  Node11 [label="ACL/AVSConnectionManager.h",height=0.2,width=0.4,color="red", fillcolor="white", style="filled",URL="$_a_v_s_connection_manager_8h.html"];
  Node11 -> Node3 [color="midnightblue",fontsize="10",style="solid",fontname="Helvetica"];
  Node11 -> Node4 [color="midnightblue",fontsize="10",style="solid",fontname="Helvetica"];
  Node11 -> Node12 [color="midnightblue",fontsize="10",style="solid",fontname="Helvetica"];
  Node12 [label="AVSCommon/SDKInterfaces\l/ConnectionStatusObserverInterface.h",height=0.2,width=0.4,color="red", fillcolor="white", style="filled",URL="$_connection_status_observer_interface_8h.html"];
  Node10 -> Node13 [color="midnightblue",fontsize="10",style="solid",fontname="Helvetica"];
  Node13 [label="ACL/Transport/MessageRouter.h",height=0.2,width=0.4,color="red", fillcolor="white", style="filled",URL="$_message_router_8h.html"];
  Node13 -> Node3 [color="midnightblue",fontsize="10",style="solid",fontname="Helvetica"];
  Node13 -> Node4 [color="midnightblue",fontsize="10",style="solid",fontname="Helvetica"];
  Node13 -> Node7 [color="midnightblue",fontsize="10",style="solid",fontname="Helvetica"];
  Node13 -> Node14 [color="midnightblue",fontsize="10",style="solid",fontname="Helvetica"];
  Node14 [label="AVSCommon/SDKInterfaces\l/AuthDelegateInterface.h",height=0.2,width=0.4,color="red", fillcolor="white", style="filled",URL="$_auth_delegate_interface_8h.html"];
  Node14 -> Node3 [color="midnightblue",fontsize="10",style="solid",fontname="Helvetica"];
  Node14 -> Node4 [color="midnightblue",fontsize="10",style="solid",fontname="Helvetica"];
  Node10 -> Node15 [color="midnightblue",fontsize="10",style="solid",fontname="Helvetica"];
  Node15 [label="ACL/Transport/PostConnect\lSynchronizer.h",height=0.2,width=0.4,color="red", fillcolor="white", style="filled",URL="$_post_connect_synchronizer_8h.html"];
  Node15 -> Node3 [color="midnightblue",fontsize="10",style="solid",fontname="Helvetica"];
  Node10 -> Node16 [color="midnightblue",fontsize="10",style="solid",fontname="Helvetica"];
  Node16 [label="ACL/Transport/PostConnect\lSynchronizerFactory.h",height=0.2,width=0.4,color="red", fillcolor="white", style="filled",URL="$_post_connect_synchronizer_factory_8h.html"];
  Node16 -> Node3 [color="midnightblue",fontsize="10",style="solid",fontname="Helvetica"];
  Node10 -> Node17 [color="midnightblue",fontsize="10",style="solid",fontname="Helvetica"];
  Node17 [label="ADSL/DirectiveSequencer.h",height=0.2,width=0.4,color="red", fillcolor="white", style="filled",URL="$_directive_sequencer_8h.html"];
  Node17 -> Node3 [color="midnightblue",fontsize="10",style="solid",fontname="Helvetica"];
  Node10 -> Node18 [color="midnightblue",fontsize="10",style="solid",fontname="Helvetica"];
  Node18 [label="AFML/AudioActivityTracker.h",height=0.2,width=0.4,color="red", fillcolor="white", style="filled",URL="$_audio_activity_tracker_8h.html"];
  Node18 -> Node3 [color="midnightblue",fontsize="10",style="solid",fontname="Helvetica"];
  Node18 -> Node4 [color="midnightblue",fontsize="10",style="solid",fontname="Helvetica"];
  Node18 -> Node7 [color="midnightblue",fontsize="10",style="solid",fontname="Helvetica"];
  Node10 -> Node19 [color="midnightblue",fontsize="10",style="solid",fontname="Helvetica"];
  Node19 [label="AFML/FocusManager.h",height=0.2,width=0.4,color="red", fillcolor="white", style="filled",URL="$_focus_manager_8h.html"];
  Node19 -> Node7 [color="midnightblue",fontsize="10",style="solid",fontname="Helvetica"];
  Node10 -> Node20 [color="midnightblue",fontsize="10",style="solid",fontname="Helvetica"];
  Node20 [label="AFML/VisualActivityTracker.h",height=0.2,width=0.4,color="red", fillcolor="white", style="filled",URL="$_visual_activity_tracker_8h.html"];
  Node20 -> Node3 [color="midnightblue",fontsize="10",style="solid",fontname="Helvetica"];
  Node20 -> Node7 [color="midnightblue",fontsize="10",style="solid",fontname="Helvetica"];
  Node10 -> Node21 [color="midnightblue",fontsize="10",style="solid",fontname="Helvetica"];
  Node21 [label="AIP/AudioInputProcessor.h",height=0.2,width=0.4,color="red", fillcolor="white", style="filled",URL="$_audio_input_processor_8h.html"];
  Node21 -> Node3 [color="midnightblue",fontsize="10",style="solid",fontname="Helvetica"];
  Node21 -> Node7 [color="midnightblue",fontsize="10",style="solid",fontname="Helvetica"];
  Node21 -> Node22 [color="midnightblue",fontsize="10",style="solid",fontname="Helvetica"];
  Node22 [label="AVSCommon/AVS/DialogUXState\lAggregator.h",height=0.2,width=0.4,color="red", fillcolor="white", style="filled",URL="$_dialog_u_x_state_aggregator_8h.html"];
  Node22 -> Node12 [color="midnightblue",fontsize="10",style="solid",fontname="Helvetica"];
  Node22 -> Node23 [color="midnightblue",fontsize="10",style="solid",fontname="Helvetica"];
  Node23 [label="AVSCommon/SDKInterfaces\l/DialogUXStateObserverInterface.h",height=0.2,width=0.4,color="red", fillcolor="white", style="filled",URL="$_dialog_u_x_state_observer_interface_8h.html"];
  Node23 -> Node4 [color="midnightblue",fontsize="10",style="solid",fontname="Helvetica"];
  Node21 -> Node23 [color="midnightblue",fontsize="10",style="solid",fontname="Helvetica"];
  Node21 -> Node24 [color="midnightblue",fontsize="10",style="solid",fontname="Helvetica"];
  Node24 [label="AudioProvider.h",height=0.2,width=0.4,color="red", fillcolor="white", style="filled",URL="$_audio_provider_8h.html"];
  Node24 -> Node5 [color="midnightblue",fontsize="10",style="solid",fontname="Helvetica"];
  Node10 -> Node24 [color="midnightblue",fontsize="10",style="solid",fontname="Helvetica"];
  Node10 -> Node25 [color="midnightblue",fontsize="10",style="solid",fontname="Helvetica"];
  Node25 [label="Alerts/AlertsCapabilityAgent.h",height=0.2,width=0.4,color="red", fillcolor="white", style="filled",URL="$_alerts_capability_agent_8h.html"];
  Node25 -> Node12 [color="midnightblue",fontsize="10",style="solid",fontname="Helvetica"];
  Node25 -> Node26 [color="midnightblue",fontsize="10",style="solid",fontname="Helvetica"];
  Node26 [label="CertifiedSender/Certified\lSender.h",height=0.2,width=0.4,color="red", fillcolor="white", style="filled",URL="$_certified_sender_8h.html"];
  Node26 -> Node12 [color="midnightblue",fontsize="10",style="solid",fontname="Helvetica"];
  Node26 -> Node3 [color="midnightblue",fontsize="10",style="solid",fontname="Helvetica"];
  Node25 -> Node4 [color="midnightblue",fontsize="10",style="solid",fontname="Helvetica"];
  Node10 -> Node27 [color="midnightblue",fontsize="10",style="solid",fontname="Helvetica"];
  Node27 [label="Alerts/Renderer/Renderer.h",height=0.2,width=0.4,color="red", fillcolor="white", style="filled",URL="$_renderer_8h.html"];
  Node27 -> Node28 [color="midnightblue",fontsize="10",style="solid",fontname="Helvetica"];
  Node28 [label="AVSCommon/Utils/MediaPlayer\l/MediaPlayerInterface.h",height=0.2,width=0.4,color="red", fillcolor="white", style="filled",URL="$_media_player_interface_8h.html"];
  Node28 -> Node3 [color="midnightblue",fontsize="10",style="solid",fontname="Helvetica"];
  Node27 -> Node4 [color="midnightblue",fontsize="10",style="solid",fontname="Helvetica"];
  Node27 -> Node7 [color="midnightblue",fontsize="10",style="solid",fontname="Helvetica"];
  Node10 -> Node29 [color="midnightblue",fontsize="10",style="solid",fontname="Helvetica"];
  Node29 [label="Alerts/Storage/AlertStorage\lInterface.h",height=0.2,width=0.4,color="red", fillcolor="white", style="filled",URL="$_alert_storage_interface_8h.html"];
  Node29 -> Node3 [color="midnightblue",fontsize="10",style="solid",fontname="Helvetica"];
  Node29 -> Node4 [color="midnightblue",fontsize="10",style="solid",fontname="Helvetica"];
  Node29 -> Node7 [color="midnightblue",fontsize="10",style="solid",fontname="Helvetica"];
  Node10 -> Node30 [color="midnightblue",fontsize="10",style="solid",fontname="Helvetica"];
  Node30 [label="AudioPlayer/AudioPlayer.h",height=0.2,width=0.4,color="red", fillcolor="white", style="filled",URL="$_audio_player_8h.html"];
  Node30 -> Node3 [color="midnightblue",fontsize="10",style="solid",fontname="Helvetica"];
  Node30 -> Node28 [color="midnightblue",fontsize="10",style="solid",fontname="Helvetica"];
  Node10 -> Node22 [color="midnightblue",fontsize="10",style="solid",fontname="Helvetica"];
  Node10 -> Node31 [color="midnightblue",fontsize="10",style="solid",fontname="Helvetica"];
  Node31 [label="AVSCommon/AVS/ExceptionEncountered\lSender.h",height=0.2,width=0.4,color="red", fillcolor="white", style="filled",URL="$_exception_encountered_sender_8h.html"];
  Node31 -> Node3 [color="midnightblue",fontsize="10",style="solid",fontname="Helvetica"];
  Node31 -> Node4 [color="midnightblue",fontsize="10",style="solid",fontname="Helvetica"];
  Node10 -> Node32 [color="midnightblue",fontsize="10",style="solid",fontname="Helvetica"];
  Node32 [label="AVSCommon/SDKInterfaces\l/Audio/AudioFactoryInterface.h",height=0.2,width=0.4,color="red", fillcolor="white", style="filled",URL="$_audio_factory_interface_8h.html"];
  Node32 -> Node3 [color="midnightblue",fontsize="10",style="solid",fontname="Helvetica"];
  Node10 -> Node33 [color="midnightblue",fontsize="10",style="solid",fontname="Helvetica"];
  Node33 [label="AVSCommon/SDKInterfaces\l/Audio/EqualizerConfiguration\lInterface.h",height=0.2,width=0.4,color="red", fillcolor="white", style="filled",URL="$_equalizer_configuration_interface_8h.html"];
  Node33 -> Node4 [color="midnightblue",fontsize="10",style="solid",fontname="Helvetica"];
  Node10 -> Node34 [color="midnightblue",fontsize="10",style="solid",fontname="Helvetica"];
  Node34 [label="AVSCommon/SDKInterfaces\l/Audio/EqualizerModeController\lInterface.h",height=0.2,width=0.4,color="red", fillcolor="white", style="filled",URL="$_equalizer_mode_controller_interface_8h.html"];
  Node10 -> Node35 [color="midnightblue",fontsize="10",style="solid",fontname="Helvetica"];
  Node35 [label="AVSCommon/SDKInterfaces\l/Audio/EqualizerStorageInterface.h",height=0.2,width=0.4,color="red", fillcolor="white", style="filled",URL="$_equalizer_storage_interface_8h.html"];
  Node35 -> Node3 [color="midnightblue",fontsize="10",style="solid",fontname="Helvetica"];
  Node10 -> Node14 [color="midnightblue",fontsize="10",style="solid",fontname="Helvetica"];
  Node10 -> Node36 [color="midnightblue",fontsize="10",style="solid",fontname="Helvetica"];
  Node36 [label="AVSCommon/SDKInterfaces\l/AudioPlayerObserverInterface.h",height=0.2,width=0.4,color="red", fillcolor="white", style="filled",URL="$_audio_player_observer_interface_8h.html"];
  Node36 -> Node4 [color="midnightblue",fontsize="10",style="solid",fontname="Helvetica"];
  Node10 -> Node37 [color="midnightblue",fontsize="10",style="solid",fontname="Helvetica"];
  Node37 [label="AVSCommon/SDKInterfaces\l/CallManagerInterface.h",height=0.2,width=0.4,color="red", fillcolor="white", style="filled",URL="$_call_manager_interface_8h.html"];
  Node37 -> Node3 [color="midnightblue",fontsize="10",style="solid",fontname="Helvetica"];
  Node37 -> Node4 [color="midnightblue",fontsize="10",style="solid",fontname="Helvetica"];
  Node37 -> Node12 [color="midnightblue",fontsize="10",style="solid",fontname="Helvetica"];
  Node10 -> Node12 [color="midnightblue",fontsize="10",style="solid",fontname="Helvetica"];
  Node10 -> Node38 [color="midnightblue",fontsize="10",style="solid",fontname="Helvetica"];
  Node38 [label="AVSCommon/SDKInterfaces\l/CapabilitiesDelegateInterface.h",height=0.2,width=0.4,color="red", fillcolor="white", style="filled",URL="$_capabilities_delegate_interface_8h.html"];
  Node38 -> Node3 [color="midnightblue",fontsize="10",style="solid",fontname="Helvetica"];
  Node38 -> Node39 [color="midnightblue",fontsize="10",style="solid",fontname="Helvetica"];
  Node39 [label="AVSCommon/SDKInterfaces\l/CapabilitiesObserverInterface.h",height=0.2,width=0.4,color="red", fillcolor="white", style="filled",URL="$_capabilities_observer_interface_8h.html"];
  Node10 -> Node39 [color="midnightblue",fontsize="10",style="solid",fontname="Helvetica"];
  Node10 -> Node23 [color="midnightblue",fontsize="10",style="solid",fontname="Helvetica"];
  Node10 -> Node40 [color="midnightblue",fontsize="10",style="solid",fontname="Helvetica"];
  Node40 [label="AVSCommon/SDKInterfaces\l/SingleSettingObserverInterface.h",height=0.2,width=0.4,color="black", fillcolor="white", style="filled",URL="$_single_setting_observer_interface_8h.html"];
  Node40 -> Node4 [color="midnightblue",fontsize="10",style="solid",fontname="Helvetica"];
  Node10 -> Node41 [color="midnightblue",fontsize="10",style="solid",fontname="Helvetica"];
  Node41 [label="AVSCommon/SDKInterfaces\l/TemplateRuntimeObserverInterface.h",height=0.2,width=0.4,color="red", fillcolor="white", style="filled",URL="$_template_runtime_observer_interface_8h.html"];
  Node41 -> Node4 [color="midnightblue",fontsize="10",style="solid",fontname="Helvetica"];
  Node10 -> Node42 [color="midnightblue",fontsize="10",style="solid",fontname="Helvetica"];
  Node42 [label="AVSCommon/Utils/DeviceInfo.h",height=0.2,width=0.4,color="red", fillcolor="white", style="filled",URL="$_device_info_8h.html"];
  Node42 -> Node4 [color="midnightblue",fontsize="10",style="solid",fontname="Helvetica"];
  Node10 -> Node43 [color="midnightblue",fontsize="10",style="solid",fontname="Helvetica"];
  Node43 [label="AVSCommon/Utils/LibcurlUtils\l/HTTPContentFetcherFactory.h",height=0.2,width=0.4,color="red", fillcolor="white", style="filled",URL="$_h_t_t_p_content_fetcher_factory_8h.html"];
  Node43 -> Node3 [color="midnightblue",fontsize="10",style="solid",fontname="Helvetica"];
  Node43 -> Node4 [color="midnightblue",fontsize="10",style="solid",fontname="Helvetica"];
  Node10 -> Node28 [color="midnightblue",fontsize="10",style="solid",fontname="Helvetica"];
  Node10 -> Node44 [color="midnightblue",fontsize="10",style="solid",fontname="Helvetica"];
  Node44 [label="AVSCommon/Utils/Network\l/InternetConnectionMonitor.h",height=0.2,width=0.4,color="red", fillcolor="white", style="filled",URL="$_internet_connection_monitor_8h.html"];
  Node44 -> Node3 [color="midnightblue",fontsize="10",style="solid",fontname="Helvetica"];
  Node10 -> Node45 [color="midnightblue",fontsize="10",style="solid",fontname="Helvetica"];
  Node45 [label="Bluetooth/Bluetooth.h",height=0.2,width=0.4,color="red", fillcolor="white", style="filled",URL="$_bluetooth_8h.html"];
  Node45 -> Node3 [color="midnightblue",fontsize="10",style="solid",fontname="Helvetica"];
  Node45 -> Node4 [color="midnightblue",fontsize="10",style="solid",fontname="Helvetica"];
  Node45 -> Node28 [color="midnightblue",fontsize="10",style="solid",fontname="Helvetica"];
  Node45 -> Node46 [color="midnightblue",fontsize="10",style="solid",fontname="Helvetica"];
  Node46 [label="Bluetooth/BluetoothStorage\lInterface.h",height=0.2,width=0.4,color="red", fillcolor="white", style="filled",URL="$_bluetooth_storage_interface_8h.html"];
  Node10 -> Node46 [color="midnightblue",fontsize="10",style="solid",fontname="Helvetica"];
  Node10 -> Node26 [color="midnightblue",fontsize="10",style="solid",fontname="Helvetica"];
  Node10 -> Node47 [color="midnightblue",fontsize="10",style="solid",fontname="Helvetica"];
  Node47 [label="CertifiedSender/SQLiteMessage\lStorage.h",height=0.2,width=0.4,color="red", fillcolor="white", style="filled",URL="$_s_q_lite_message_storage_8h.html"];
  Node10 -> Node48 [color="midnightblue",fontsize="10",style="solid",fontname="Helvetica"];
  Node48 [label="DoNotDisturbCA/DoNotDisturb\lCapabilityAgent.h",height=0.2,width=0.4,color="red", fillcolor="white", style="filled",URL="$_do_not_disturb_capability_agent_8h.html"];
  Node48 -> Node3 [color="midnightblue",fontsize="10",style="solid",fontname="Helvetica"];
  Node48 -> Node38 [color="midnightblue",fontsize="10",style="solid",fontname="Helvetica"];
  Node48 -> Node12 [color="midnightblue",fontsize="10",style="solid",fontname="Helvetica"];
  Node10 -> Node49 [color="midnightblue",fontsize="10",style="solid",fontname="Helvetica"];
  Node49 [label="Equalizer/EqualizerCapability\lAgent.h",height=0.2,width=0.4,color="red", fillcolor="white", style="filled",URL="$_equalizer_capability_agent_8h.html"];
  Node49 -> Node3 [color="midnightblue",fontsize="10",style="solid",fontname="Helvetica"];
  Node49 -> Node34 [color="midnightblue",fontsize="10",style="solid",fontname="Helvetica"];
  Node49 -> Node38 [color="midnightblue",fontsize="10",style="solid",fontname="Helvetica"];
  Node49 -> Node35 [color="midnightblue",fontsize="10",style="solid",fontname="Helvetica"];
  Node2 -> Node50 [color="midnightblue",fontsize="10",style="solid",fontname="Helvetica"];
  Node50 [label="ESP/ESPDataProviderInterface.h",height=0.2,width=0.4,color="red", fillcolor="white", style="filled",URL="$_e_s_p_data_provider_interface_8h.html"];
}
