digraph "/workplace/avs-device-sdk/RegistrationManager/include/RegistrationManager/RegistrationManager.h"
{
  edge [fontname="Helvetica",fontsize="10",labelfontname="Helvetica",labelfontsize="10"];
  node [fontname="Helvetica",fontsize="10",shape=record];
  Node1 [label="/workplace/avs-device\l-sdk/RegistrationManager\l/include/RegistrationManager\l/RegistrationManager.h",height=0.2,width=0.4,color="black", fillcolor="grey75", style="filled", fontcolor="black"];
  Node1 -> Node2 [color="midnightblue",fontsize="10",style="solid",fontname="Helvetica"];
  Node2 [label="memory",height=0.2,width=0.4,color="grey75", fillcolor="white", style="filled"];
  Node1 -> Node3 [color="midnightblue",fontsize="10",style="solid",fontname="Helvetica"];
  Node3 [label="unordered_set",height=0.2,width=0.4,color="grey75", fillcolor="white", style="filled"];
  Node1 -> Node4 [color="midnightblue",fontsize="10",style="solid",fontname="Helvetica"];
  Node4 [label="AVSCommon/SDKInterfaces\l/AuthDelegateInterface.h",height=0.2,width=0.4,color="black", fillcolor="white", style="filled",URL="$_auth_delegate_interface_8h.html"];
  Node4 -> Node2 [color="midnightblue",fontsize="10",style="solid",fontname="Helvetica"];
  Node4 -> Node5 [color="midnightblue",fontsize="10",style="solid",fontname="Helvetica"];
  Node5 [label="string",height=0.2,width=0.4,color="grey75", fillcolor="white", style="filled"];
  Node4 -> Node6 [color="midnightblue",fontsize="10",style="solid",fontname="Helvetica"];
  Node6 [label="AVSCommon/SDKInterfaces\l/AuthObserverInterface.h",height=0.2,width=0.4,color="black", fillcolor="white", style="filled",URL="$_auth_observer_interface_8h.html"];
  Node6 -> Node7 [color="midnightblue",fontsize="10",style="solid",fontname="Helvetica"];
  Node7 [label="ostream",height=0.2,width=0.4,color="grey75", fillcolor="white", style="filled"];
  Node1 -> Node8 [color="midnightblue",fontsize="10",style="solid",fontname="Helvetica"];
  Node8 [label="AVSCommon/SDKInterfaces\l/AVSConnectionManagerInterface.h",height=0.2,width=0.4,color="black", fillcolor="white", style="filled",URL="$_a_v_s_connection_manager_interface_8h.html"];
  Node8 -> Node2 [color="midnightblue",fontsize="10",style="solid",fontname="Helvetica"];
  Node8 -> Node9 [color="midnightblue",fontsize="10",style="solid",fontname="Helvetica"];
  Node9 [label="AVSCommon/SDKInterfaces\l/ConnectionStatusObserverInterface.h",height=0.2,width=0.4,color="black", fillcolor="white", style="filled",URL="$_connection_status_observer_interface_8h.html"];
  Node9 -> Node10 [color="midnightblue",fontsize="10",style="solid",fontname="Helvetica"];
  Node10 [label="iostream",height=0.2,width=0.4,color="grey75", fillcolor="white", style="filled"];
  Node8 -> Node11 [color="midnightblue",fontsize="10",style="solid",fontname="Helvetica"];
  Node11 [label="AVSCommon/SDKInterfaces\l/MessageObserverInterface.h",height=0.2,width=0.4,color="black", fillcolor="white", style="filled",URL="$_message_observer_interface_8h.html"];
  Node11 -> Node5 [color="midnightblue",fontsize="10",style="solid",fontname="Helvetica"];
  Node1 -> Node12 [color="midnightblue",fontsize="10",style="solid",fontname="Helvetica"];
  Node12 [label="AVSCommon/SDKInterfaces\l/DirectiveSequencerInterface.h",height=0.2,width=0.4,color="black", fillcolor="white", style="filled",URL="$_directive_sequencer_interface_8h.html"];
  Node12 -> Node2 [color="midnightblue",fontsize="10",style="solid",fontname="Helvetica"];
  Node12 -> Node5 [color="midnightblue",fontsize="10",style="solid",fontname="Helvetica"];
  Node12 -> Node13 [color="midnightblue",fontsize="10",style="solid",fontname="Helvetica"];
  Node13 [label="AVSCommon/AVS/AVSDirective.h",height=0.2,width=0.4,color="black", fillcolor="white", style="filled",URL="$_a_v_s_directive_8h.html"];
  Node13 -> Node10 [color="midnightblue",fontsize="10",style="solid",fontname="Helvetica"];
  Node13 -> Node2 [color="midnightblue",fontsize="10",style="solid",fontname="Helvetica"];
  Node13 -> Node5 [color="midnightblue",fontsize="10",style="solid",fontname="Helvetica"];
  Node13 -> Node14 [color="midnightblue",fontsize="10",style="solid",fontname="Helvetica"];
  Node14 [label="utility",height=0.2,width=0.4,color="grey75", fillcolor="white", style="filled"];
  Node13 -> Node15 [color="midnightblue",fontsize="10",style="solid",fontname="Helvetica"];
  Node15 [label="Attachment/AttachmentManager\lInterface.h",height=0.2,width=0.4,color="black", fillcolor="white", style="filled",URL="$_attachment_manager_interface_8h.html"];
  Node15 -> Node16 [color="midnightblue",fontsize="10",style="solid",fontname="Helvetica"];
  Node16 [label="chrono",height=0.2,width=0.4,color="grey75", fillcolor="white", style="filled"];
  Node15 -> Node5 [color="midnightblue",fontsize="10",style="solid",fontname="Helvetica"];
  Node15 -> Node2 [color="midnightblue",fontsize="10",style="solid",fontname="Helvetica"];
  Node15 -> Node17 [color="midnightblue",fontsize="10",style="solid",fontname="Helvetica"];
  Node17 [label="AVSCommon/AVS/Attachment\l/Attachment.h",height=0.2,width=0.4,color="black", fillcolor="white", style="filled",URL="$_attachment_8h.html"];
  Node17 -> Node18 [color="midnightblue",fontsize="10",style="solid",fontname="Helvetica"];
  Node18 [label="atomic",height=0.2,width=0.4,color="grey75", fillcolor="white", style="filled"];
  Node17 -> Node19 [color="midnightblue",fontsize="10",style="solid",fontname="Helvetica"];
  Node19 [label="mutex",height=0.2,width=0.4,color="grey75", fillcolor="white", style="filled"];
  Node17 -> Node5 [color="midnightblue",fontsize="10",style="solid",fontname="Helvetica"];
  Node17 -> Node20 [color="midnightblue",fontsize="10",style="solid",fontname="Helvetica"];
  Node20 [label="AVSCommon/AVS/Attachment\l/AttachmentReader.h",height=0.2,width=0.4,color="black", fillcolor="white", style="filled",URL="$_attachment_reader_8h.html"];
  Node20 -> Node16 [color="midnightblue",fontsize="10",style="solid",fontname="Helvetica"];
  Node20 -> Node21 [color="midnightblue",fontsize="10",style="solid",fontname="Helvetica"];
  Node21 [label="cstddef",height=0.2,width=0.4,color="grey75", fillcolor="white", style="filled"];
  Node20 -> Node7 [color="midnightblue",fontsize="10",style="solid",fontname="Helvetica"];
  Node20 -> Node22 [color="midnightblue",fontsize="10",style="solid",fontname="Helvetica"];
  Node22 [label="AVSCommon/Utils/SDS\l/ReaderPolicy.h",height=0.2,width=0.4,color="black", fillcolor="white", style="filled",URL="$_reader_policy_8h.html"];
  Node17 -> Node23 [color="midnightblue",fontsize="10",style="solid",fontname="Helvetica"];
  Node23 [label="AVSCommon/AVS/Attachment\l/AttachmentWriter.h",height=0.2,width=0.4,color="black", fillcolor="white", style="filled",URL="$_attachment_writer_8h.html"];
  Node23 -> Node16 [color="midnightblue",fontsize="10",style="solid",fontname="Helvetica"];
  Node23 -> Node21 [color="midnightblue",fontsize="10",style="solid",fontname="Helvetica"];
  Node17 -> Node24 [color="midnightblue",fontsize="10",style="solid",fontname="Helvetica"];
  Node24 [label="AVSCommon/Utils/SDS\l/InProcessSDS.h",height=0.2,width=0.4,color="black", fillcolor="white", style="filled",URL="$_in_process_s_d_s_8h.html"];
  Node24 -> Node25 [color="midnightblue",fontsize="10",style="solid",fontname="Helvetica"];
  Node25 [label="vector",height=0.2,width=0.4,color="grey75", fillcolor="white", style="filled"];
  Node24 -> Node19 [color="midnightblue",fontsize="10",style="solid",fontname="Helvetica"];
  Node24 -> Node18 [color="midnightblue",fontsize="10",style="solid",fontname="Helvetica"];
  Node24 -> Node26 [color="midnightblue",fontsize="10",style="solid",fontname="Helvetica"];
  Node26 [label="condition_variable",height=0.2,width=0.4,color="grey75", fillcolor="white", style="filled"];
  Node24 -> Node5 [color="midnightblue",fontsize="10",style="solid",fontname="Helvetica"];
  Node24 -> Node27 [color="midnightblue",fontsize="10",style="solid",fontname="Helvetica"];
  Node27 [label="SharedDataStream.h",height=0.2,width=0.4,color="black", fillcolor="white", style="filled",URL="$_shared_data_stream_8h.html"];
  Node27 -> Node28 [color="midnightblue",fontsize="10",style="solid",fontname="Helvetica"];
  Node28 [label="cstdint",height=0.2,width=0.4,color="grey75", fillcolor="white", style="filled"];
  Node27 -> Node21 [color="midnightblue",fontsize="10",style="solid",fontname="Helvetica"];
  Node27 -> Node2 [color="midnightblue",fontsize="10",style="solid",fontname="Helvetica"];
  Node27 -> Node29 [color="midnightblue",fontsize="10",style="solid",fontname="Helvetica"];
  Node29 [label="AVSCommon/Utils/Logger\l/LoggerUtils.h",height=0.2,width=0.4,color="black", fillcolor="white", style="filled",URL="$_logger_utils_8h.html"];
  Node29 -> Node16 [color="midnightblue",fontsize="10",style="solid",fontname="Helvetica"];
  Node29 -> Node30 [color="midnightblue",fontsize="10",style="solid",fontname="Helvetica"];
  Node30 [label="AVSCommon/Utils/Logger\l/Logger.h",height=0.2,width=0.4,color="red", fillcolor="white", style="filled",URL="$_logger_8h.html"];
  Node30 -> Node18 [color="midnightblue",fontsize="10",style="solid",fontname="Helvetica"];
  Node30 -> Node16 [color="midnightblue",fontsize="10",style="solid",fontname="Helvetica"];
  Node30 -> Node19 [color="midnightblue",fontsize="10",style="solid",fontname="Helvetica"];
  Node30 -> Node25 [color="midnightblue",fontsize="10",style="solid",fontname="Helvetica"];
  Node27 -> Node31 [color="midnightblue",fontsize="10",style="solid",fontname="Helvetica"];
  Node31 [label="BufferLayout.h",height=0.2,width=0.4,color="black", fillcolor="white", style="filled",URL="$_buffer_layout_8h.html"];
  Node31 -> Node28 [color="midnightblue",fontsize="10",style="solid",fontname="Helvetica"];
  Node31 -> Node21 [color="midnightblue",fontsize="10",style="solid",fontname="Helvetica"];
  Node31 -> Node19 [color="midnightblue",fontsize="10",style="solid",fontname="Helvetica"];
  Node31 -> Node5 [color="midnightblue",fontsize="10",style="solid",fontname="Helvetica"];
  Node31 -> Node25 [color="midnightblue",fontsize="10",style="solid",fontname="Helvetica"];
  Node31 -> Node29 [color="midnightblue",fontsize="10",style="solid",fontname="Helvetica"];
  Node31 -> Node27 [color="midnightblue",fontsize="10",style="solid",fontname="Helvetica"];
  Node27 -> Node32 [color="midnightblue",fontsize="10",style="solid",fontname="Helvetica"];
  Node32 [label="Reader.h",height=0.2,width=0.4,color="black", fillcolor="white", style="filled",URL="$_reader_8h.html"];
  Node32 -> Node28 [color="midnightblue",fontsize="10",style="solid",fontname="Helvetica"];
  Node32 -> Node21 [color="midnightblue",fontsize="10",style="solid",fontname="Helvetica"];
  Node32 -> Node25 [color="midnightblue",fontsize="10",style="solid",fontname="Helvetica"];
  Node32 -> Node19 [color="midnightblue",fontsize="10",style="solid",fontname="Helvetica"];
  Node32 -> Node33 [color="midnightblue",fontsize="10",style="solid",fontname="Helvetica"];
  Node33 [label="limits",height=0.2,width=0.4,color="grey75", fillcolor="white", style="filled"];
  Node32 -> Node34 [color="midnightblue",fontsize="10",style="solid",fontname="Helvetica"];
  Node34 [label="cstring",height=0.2,width=0.4,color="grey75", fillcolor="white", style="filled"];
  Node32 -> Node29 [color="midnightblue",fontsize="10",style="solid",fontname="Helvetica"];
  Node32 -> Node27 [color="midnightblue",fontsize="10",style="solid",fontname="Helvetica"];
  Node32 -> Node22 [color="midnightblue",fontsize="10",style="solid",fontname="Helvetica"];
  Node27 -> Node35 [color="midnightblue",fontsize="10",style="solid",fontname="Helvetica"];
  Node35 [label="Writer.h",height=0.2,width=0.4,color="black", fillcolor="white", style="filled",URL="$_writer_8h.html"];
  Node35 -> Node28 [color="midnightblue",fontsize="10",style="solid",fontname="Helvetica"];
  Node35 -> Node21 [color="midnightblue",fontsize="10",style="solid",fontname="Helvetica"];
  Node35 -> Node25 [color="midnightblue",fontsize="10",style="solid",fontname="Helvetica"];
  Node35 -> Node19 [color="midnightblue",fontsize="10",style="solid",fontname="Helvetica"];
  Node35 -> Node33 [color="midnightblue",fontsize="10",style="solid",fontname="Helvetica"];
  Node35 -> Node34 [color="midnightblue",fontsize="10",style="solid",fontname="Helvetica"];
  Node35 -> Node29 [color="midnightblue",fontsize="10",style="solid",fontname="Helvetica"];
  Node35 -> Node27 [color="midnightblue",fontsize="10",style="solid",fontname="Helvetica"];
  Node35 -> Node36 [color="midnightblue",fontsize="10",style="solid",fontname="Helvetica"];
  Node36 [label="WriterPolicy.h",height=0.2,width=0.4,color="black", fillcolor="white", style="filled",URL="$_writer_policy_8h.html"];
  Node17 -> Node22 [color="midnightblue",fontsize="10",style="solid",fontname="Helvetica"];
  Node17 -> Node36 [color="midnightblue",fontsize="10",style="solid",fontname="Helvetica"];
  Node15 -> Node20 [color="midnightblue",fontsize="10",style="solid",fontname="Helvetica"];
  Node15 -> Node23 [color="midnightblue",fontsize="10",style="solid",fontname="Helvetica"];
  Node13 -> Node37 [color="midnightblue",fontsize="10",style="solid",fontname="Helvetica"];
  Node37 [label="AVSMessage.h",height=0.2,width=0.4,color="black", fillcolor="white", style="filled",URL="$_a_v_s_message_8h.html"];
  Node37 -> Node38 [color="midnightblue",fontsize="10",style="solid",fontname="Helvetica"];
  Node38 [label="AVSMessageHeader.h",height=0.2,width=0.4,color="black", fillcolor="white", style="filled",URL="$_a_v_s_message_header_8h.html"];
  Node38 -> Node5 [color="midnightblue",fontsize="10",style="solid",fontname="Helvetica"];
  Node37 -> Node2 [color="midnightblue",fontsize="10",style="solid",fontname="Helvetica"];
  Node37 -> Node5 [color="midnightblue",fontsize="10",style="solid",fontname="Helvetica"];
  Node12 -> Node39 [color="midnightblue",fontsize="10",style="solid",fontname="Helvetica"];
  Node39 [label="AVSCommon/SDKInterfaces\l/DirectiveHandlerInterface.h",height=0.2,width=0.4,color="black", fillcolor="white", style="filled",URL="$_directive_handler_interface_8h.html"];
  Node39 -> Node2 [color="midnightblue",fontsize="10",style="solid",fontname="Helvetica"];
  Node39 -> Node13 [color="midnightblue",fontsize="10",style="solid",fontname="Helvetica"];
  Node39 -> Node40 [color="midnightblue",fontsize="10",style="solid",fontname="Helvetica"];
  Node40 [label="AVSCommon/AVS/DirectiveHandler\lConfiguration.h",height=0.2,width=0.4,color="black", fillcolor="white", style="filled",URL="$_directive_handler_configuration_8h.html"];
  Node40 -> Node41 [color="midnightblue",fontsize="10",style="solid",fontname="Helvetica"];
  Node41 [label="unordered_map",height=0.2,width=0.4,color="grey75", fillcolor="white", style="filled"];
  Node40 -> Node42 [color="midnightblue",fontsize="10",style="solid",fontname="Helvetica"];
  Node42 [label="NamespaceAndName.h",height=0.2,width=0.4,color="black", fillcolor="white", style="filled",URL="$_namespace_and_name_8h.html"];
  Node42 -> Node5 [color="midnightblue",fontsize="10",style="solid",fontname="Helvetica"];
  Node40 -> Node43 [color="midnightblue",fontsize="10",style="solid",fontname="Helvetica"];
  Node43 [label="BlockingPolicy.h",height=0.2,width=0.4,color="black", fillcolor="white", style="filled",URL="$_blocking_policy_8h.html"];
  Node43 -> Node44 [color="midnightblue",fontsize="10",style="solid",fontname="Helvetica"];
  Node44 [label="bitset",height=0.2,width=0.4,color="grey75", fillcolor="white", style="filled"];
  Node43 -> Node10 [color="midnightblue",fontsize="10",style="solid",fontname="Helvetica"];
  Node39 -> Node45 [color="midnightblue",fontsize="10",style="solid",fontname="Helvetica"];
  Node45 [label="AVSCommon/SDKInterfaces\l/DirectiveHandlerResultInterface.h",height=0.2,width=0.4,color="black", fillcolor="white", style="filled",URL="$_directive_handler_result_interface_8h.html"];
  Node45 -> Node2 [color="midnightblue",fontsize="10",style="solid",fontname="Helvetica"];
  Node45 -> Node13 [color="midnightblue",fontsize="10",style="solid",fontname="Helvetica"];
  Node12 -> Node46 [color="midnightblue",fontsize="10",style="solid",fontname="Helvetica"];
  Node46 [label="AVSCommon/Utils/Requires\lShutdown.h",height=0.2,width=0.4,color="black", fillcolor="white", style="filled",URL="$_requires_shutdown_8h.html"];
  Node46 -> Node18 [color="midnightblue",fontsize="10",style="solid",fontname="Helvetica"];
  Node46 -> Node2 [color="midnightblue",fontsize="10",style="solid",fontname="Helvetica"];
  Node46 -> Node19 [color="midnightblue",fontsize="10",style="solid",fontname="Helvetica"];
  Node46 -> Node5 [color="midnightblue",fontsize="10",style="solid",fontname="Helvetica"];
  Node1 -> Node47 [color="midnightblue",fontsize="10",style="solid",fontname="Helvetica"];
  Node47 [label="RegistrationManager\l/CustomerDataManager.h",height=0.2,width=0.4,color="black", fillcolor="white", style="filled",URL="$_customer_data_manager_8h.html"];
  Node47 -> Node48 [color="midnightblue",fontsize="10",style="solid",fontname="Helvetica"];
  Node48 [label="list",height=0.2,width=0.4,color="grey75", fillcolor="white", style="filled"];
  Node47 -> Node19 [color="midnightblue",fontsize="10",style="solid",fontname="Helvetica"];
  Node47 -> Node3 [color="midnightblue",fontsize="10",style="solid",fontname="Helvetica"];
  Node47 -> Node49 [color="midnightblue",fontsize="10",style="solid",fontname="Helvetica"];
  Node49 [label="RegistrationManager\l/CustomerDataHandler.h",height=0.2,width=0.4,color="black", fillcolor="white", style="filled",URL="$_customer_data_handler_8h.html"];
  Node49 -> Node2 [color="midnightblue",fontsize="10",style="solid",fontname="Helvetica"];
  Node1 -> Node50 [color="midnightblue",fontsize="10",style="solid",fontname="Helvetica"];
  Node50 [label="RegistrationManager\l/RegistrationObserverInterface.h",height=0.2,width=0.4,color="black", fillcolor="white", style="filled",URL="$_registration_observer_interface_8h.html"];
}
