digraph "alexaClientSDK::authorization::cblAuthDelegate::CBLAuthDelegateStorageInterface"
{
  edge [fontname="Helvetica",fontsize="10",labelfontname="Helvetica",labelfontsize="10"];
  node [fontname="Helvetica",fontsize="10",shape=record];
  Node1 [label="alexaClientSDK::authorization\l::cblAuthDelegate::CBLAuthDelegate\lStorageInterface",height=0.2,width=0.4,color="black", fillcolor="grey75", style="filled", fontcolor="black"];
  Node1 -> Node2 [dir="back",color="midnightblue",fontsize="10",style="solid",fontname="Helvetica"];
  Node2 [label="alexaClientSDK::authorization\l::cblAuthDelegate::SQLiteCBLAuth\lDelegateStorage",height=0.2,width=0.4,color="black", fillcolor="white", style="filled",URL="$classalexa_client_s_d_k_1_1authorization_1_1cbl_auth_delegate_1_1_s_q_lite_c_b_l_auth_delegate_storage.html"];
}
