digraph "/workplace/avs-device-sdk/AVSCommon/Utils/include/AVSCommon/Utils/PlaylistParser/IterativePlaylistParserInterface.h"
{
  edge [fontname="Helvetica",fontsize="10",labelfontname="Helvetica",labelfontsize="10"];
  node [fontname="Helvetica",fontsize="10",shape=record];
  Node1 [label="/workplace/avs-device\l-sdk/AVSCommon/Utils\l/include/AVSCommon/Utils\l/PlaylistParser/IterativePlaylist\lParserInterface.h",height=0.2,width=0.4,color="black", fillcolor="grey75", style="filled", fontcolor="black"];
  Node1 -> Node2 [dir="back",color="midnightblue",fontsize="10",style="solid",fontname="Helvetica"];
  Node2 [label="/workplace/avs-device\l-sdk/MediaPlayer/AndroidSLESMedia\lPlayer/include/AndroidSLESMediaPlayer\l/AndroidSLESMediaPlayer.h",height=0.2,width=0.4,color="black", fillcolor="white", style="filled",URL="$_android_s_l_e_s_media_player_8h.html"];
  Node2 -> Node3 [dir="back",color="midnightblue",fontsize="10",style="solid",fontname="Helvetica"];
  Node3 [label="/workplace/avs-device\l-sdk/MediaPlayer/AndroidSLESMedia\lPlayer/src/AndroidSLESMediaPlayer.cpp",height=0.2,width=0.4,color="black", fillcolor="white", style="filled",URL="$_android_s_l_e_s_media_player_8cpp.html"];
  Node2 -> Node4 [dir="back",color="midnightblue",fontsize="10",style="solid",fontname="Helvetica"];
  Node4 [label="/workplace/avs-device\l-sdk/MediaPlayer/AndroidSLESMedia\lPlayer/test/AndroidSLESMediaPlayerTest.cpp",height=0.2,width=0.4,color="black", fillcolor="white", style="filled",URL="$_android_s_l_e_s_media_player_test_8cpp.html"];
  Node1 -> Node5 [dir="back",color="midnightblue",fontsize="10",style="solid",fontname="Helvetica"];
  Node5 [label="/workplace/avs-device\l-sdk/MediaPlayer/AndroidSLESMedia\lPlayer/include/AndroidSLESMediaPlayer\l/FFmpegUrlInputController.h",height=0.2,width=0.4,color="black", fillcolor="white", style="filled",URL="$_f_fmpeg_url_input_controller_8h.html"];
  Node5 -> Node3 [dir="back",color="midnightblue",fontsize="10",style="solid",fontname="Helvetica"];
  Node5 -> Node6 [dir="back",color="midnightblue",fontsize="10",style="solid",fontname="Helvetica"];
  Node6 [label="/workplace/avs-device\l-sdk/MediaPlayer/AndroidSLESMedia\lPlayer/src/FFmpegUrlInputController.cpp",height=0.2,width=0.4,color="black", fillcolor="white", style="filled",URL="$_f_fmpeg_url_input_controller_8cpp.html"];
  Node5 -> Node7 [dir="back",color="midnightblue",fontsize="10",style="solid",fontname="Helvetica"];
  Node7 [label="/workplace/avs-device\l-sdk/MediaPlayer/AndroidSLESMedia\lPlayer/test/FFmpegUrlInputController\lTest.cpp",height=0.2,width=0.4,color="black", fillcolor="white", style="filled",URL="$_f_fmpeg_url_input_controller_test_8cpp.html"];
  Node1 -> Node7 [dir="back",color="midnightblue",fontsize="10",style="solid",fontname="Helvetica"];
  Node1 -> Node8 [dir="back",color="midnightblue",fontsize="10",style="solid",fontname="Helvetica"];
  Node8 [label="/workplace/avs-device\l-sdk/PlaylistParser/include\l/PlaylistParser/IterativePlaylist\lParser.h",height=0.2,width=0.4,color="black", fillcolor="white", style="filled",URL="$_iterative_playlist_parser_8h.html"];
  Node8 -> Node3 [dir="back",color="midnightblue",fontsize="10",style="solid",fontname="Helvetica"];
  Node8 -> Node7 [dir="back",color="midnightblue",fontsize="10",style="solid",fontname="Helvetica"];
  Node8 -> Node9 [dir="back",color="midnightblue",fontsize="10",style="solid",fontname="Helvetica"];
  Node9 [label="/workplace/avs-device\l-sdk/PlaylistParser/src\l/IterativePlaylistParser.cpp",height=0.2,width=0.4,color="black", fillcolor="white", style="filled",URL="$_iterative_playlist_parser_8cpp.html"];
  Node8 -> Node10 [dir="back",color="midnightblue",fontsize="10",style="solid",fontname="Helvetica"];
  Node10 [label="/workplace/avs-device\l-sdk/PlaylistParser/test\l/IterativePlaylistParserTest.cpp",height=0.2,width=0.4,color="black", fillcolor="white", style="filled",URL="$_iterative_playlist_parser_test_8cpp.html"];
}
