digraph "/workplace/avs-device-sdk/MediaPlayer/AndroidSLESMediaPlayer/include/AndroidSLESMediaPlayer/FFmpegUrlInputController.h"
{
  edge [fontname="Helvetica",fontsize="10",labelfontname="Helvetica",labelfontsize="10"];
  node [fontname="Helvetica",fontsize="10",shape=record];
  Node1 [label="/workplace/avs-device\l-sdk/MediaPlayer/AndroidSLESMedia\lPlayer/include/AndroidSLESMediaPlayer\l/FFmpegUrlInputController.h",height=0.2,width=0.4,color="black", fillcolor="grey75", style="filled", fontcolor="black"];
  Node1 -> Node2 [color="midnightblue",fontsize="10",style="solid",fontname="Helvetica"];
  Node2 [label="chrono",height=0.2,width=0.4,color="grey75", fillcolor="white", style="filled"];
  Node1 -> Node3 [color="midnightblue",fontsize="10",style="solid",fontname="Helvetica"];
  Node3 [label="memory",height=0.2,width=0.4,color="grey75", fillcolor="white", style="filled"];
  Node1 -> Node4 [color="midnightblue",fontsize="10",style="solid",fontname="Helvetica"];
  Node4 [label="queue",height=0.2,width=0.4,color="grey75", fillcolor="white", style="filled"];
  Node1 -> Node5 [color="midnightblue",fontsize="10",style="solid",fontname="Helvetica"];
  Node5 [label="AVSCommon/SDKInterfaces\l/HTTPContentFetcherInterface\lFactoryInterface.h",height=0.2,width=0.4,color="black", fillcolor="white", style="filled",URL="$_h_t_t_p_content_fetcher_interface_factory_interface_8h.html"];
  Node5 -> Node3 [color="midnightblue",fontsize="10",style="solid",fontname="Helvetica"];
  Node5 -> Node6 [color="midnightblue",fontsize="10",style="solid",fontname="Helvetica"];
  Node6 [label="string",height=0.2,width=0.4,color="grey75", fillcolor="white", style="filled"];
  Node5 -> Node7 [color="midnightblue",fontsize="10",style="solid",fontname="Helvetica"];
  Node7 [label="AVSCommon/SDKInterfaces\l/HTTPContentFetcherInterface.h",height=0.2,width=0.4,color="black", fillcolor="white", style="filled",URL="$_h_t_t_p_content_fetcher_interface_8h.html"];
  Node7 -> Node3 [color="midnightblue",fontsize="10",style="solid",fontname="Helvetica"];
  Node7 -> Node8 [color="midnightblue",fontsize="10",style="solid",fontname="Helvetica"];
  Node8 [label="AVSCommon/Utils/HTTP\l/HttpResponseCode.h",height=0.2,width=0.4,color="black", fillcolor="white", style="filled",URL="$_http_response_code_8h.html"];
  Node8 -> Node9 [color="midnightblue",fontsize="10",style="solid",fontname="Helvetica"];
  Node9 [label="iostream",height=0.2,width=0.4,color="grey75", fillcolor="white", style="filled"];
  Node8 -> Node6 [color="midnightblue",fontsize="10",style="solid",fontname="Helvetica"];
  Node8 -> Node10 [color="midnightblue",fontsize="10",style="solid",fontname="Helvetica"];
  Node10 [label="AVSCommon/Utils/Logger\l/LoggerUtils.h",height=0.2,width=0.4,color="black", fillcolor="white", style="filled",URL="$_logger_utils_8h.html"];
  Node10 -> Node2 [color="midnightblue",fontsize="10",style="solid",fontname="Helvetica"];
  Node10 -> Node11 [color="midnightblue",fontsize="10",style="solid",fontname="Helvetica"];
  Node11 [label="AVSCommon/Utils/Logger\l/Logger.h",height=0.2,width=0.4,color="black", fillcolor="white", style="filled",URL="$_logger_8h.html"];
  Node11 -> Node12 [color="midnightblue",fontsize="10",style="solid",fontname="Helvetica"];
  Node12 [label="atomic",height=0.2,width=0.4,color="grey75", fillcolor="white", style="filled"];
  Node11 -> Node2 [color="midnightblue",fontsize="10",style="solid",fontname="Helvetica"];
  Node11 -> Node13 [color="midnightblue",fontsize="10",style="solid",fontname="Helvetica"];
  Node13 [label="mutex",height=0.2,width=0.4,color="grey75", fillcolor="white", style="filled"];
  Node11 -> Node14 [color="midnightblue",fontsize="10",style="solid",fontname="Helvetica"];
  Node14 [label="sstream",height=0.2,width=0.4,color="grey75", fillcolor="white", style="filled"];
  Node11 -> Node15 [color="midnightblue",fontsize="10",style="solid",fontname="Helvetica"];
  Node15 [label="vector",height=0.2,width=0.4,color="grey75", fillcolor="white", style="filled"];
  Node11 -> Node16 [color="midnightblue",fontsize="10",style="solid",fontname="Helvetica"];
  Node16 [label="AVSCommon/Utils/Configuration\l/ConfigurationNode.h",height=0.2,width=0.4,color="black", fillcolor="white", style="filled",URL="$_configuration_node_8h.html"];
  Node16 -> Node2 [color="midnightblue",fontsize="10",style="solid",fontname="Helvetica"];
  Node16 -> Node9 [color="midnightblue",fontsize="10",style="solid",fontname="Helvetica"];
  Node16 -> Node3 [color="midnightblue",fontsize="10",style="solid",fontname="Helvetica"];
  Node16 -> Node13 [color="midnightblue",fontsize="10",style="solid",fontname="Helvetica"];
  Node16 -> Node6 [color="midnightblue",fontsize="10",style="solid",fontname="Helvetica"];
  Node16 -> Node15 [color="midnightblue",fontsize="10",style="solid",fontname="Helvetica"];
  Node16 -> Node17 [color="midnightblue",fontsize="10",style="solid",fontname="Helvetica"];
  Node17 [label="rapidjson/document.h",height=0.2,width=0.4,color="grey75", fillcolor="white", style="filled"];
  Node11 -> Node18 [color="midnightblue",fontsize="10",style="solid",fontname="Helvetica"];
  Node18 [label="AVSCommon/Utils/Logger\l/Level.h",height=0.2,width=0.4,color="black", fillcolor="white", style="filled",URL="$_level_8h.html"];
  Node18 -> Node6 [color="midnightblue",fontsize="10",style="solid",fontname="Helvetica"];
  Node11 -> Node19 [color="midnightblue",fontsize="10",style="solid",fontname="Helvetica"];
  Node19 [label="AVSCommon/Utils/Logger\l/LogEntry.h",height=0.2,width=0.4,color="black", fillcolor="white", style="filled",URL="$_log_entry_8h.html"];
  Node19 -> Node14 [color="midnightblue",fontsize="10",style="solid",fontname="Helvetica"];
  Node19 -> Node6 [color="midnightblue",fontsize="10",style="solid",fontname="Helvetica"];
  Node19 -> Node20 [color="midnightblue",fontsize="10",style="solid",fontname="Helvetica"];
  Node20 [label="AVSCommon/Utils/Logger\l/LogEntryStream.h",height=0.2,width=0.4,color="black", fillcolor="white", style="filled",URL="$_log_entry_stream_8h.html"];
  Node20 -> Node21 [color="midnightblue",fontsize="10",style="solid",fontname="Helvetica"];
  Node21 [label="ostream",height=0.2,width=0.4,color="grey75", fillcolor="white", style="filled"];
  Node20 -> Node22 [color="midnightblue",fontsize="10",style="solid",fontname="Helvetica"];
  Node22 [label="AVSCommon/Utils/Logger\l/LogEntryBuffer.h",height=0.2,width=0.4,color="red", fillcolor="white", style="filled",URL="$_log_entry_buffer_8h.html"];
  Node22 -> Node3 [color="midnightblue",fontsize="10",style="solid",fontname="Helvetica"];
  Node22 -> Node15 [color="midnightblue",fontsize="10",style="solid",fontname="Helvetica"];
  Node11 -> Node23 [color="midnightblue",fontsize="10",style="solid",fontname="Helvetica"];
  Node23 [label="AVSCommon/Utils/Logger\l/LogLevelObserverInterface.h",height=0.2,width=0.4,color="black", fillcolor="white", style="filled",URL="$_log_level_observer_interface_8h.html"];
  Node23 -> Node18 [color="midnightblue",fontsize="10",style="solid",fontname="Helvetica"];
  Node11 -> Node24 [color="midnightblue",fontsize="10",style="solid",fontname="Helvetica"];
  Node24 [label="AVSCommon/Utils/Logger\l/SinkObserverInterface.h",height=0.2,width=0.4,color="black", fillcolor="white", style="filled",URL="$_sink_observer_interface_8h.html"];
  Node24 -> Node3 [color="midnightblue",fontsize="10",style="solid",fontname="Helvetica"];
  Node7 -> Node25 [color="midnightblue",fontsize="10",style="solid",fontname="Helvetica"];
  Node25 [label="AVSCommon/Utils/HTTPContent.h",height=0.2,width=0.4,color="black", fillcolor="white", style="filled",URL="$_h_t_t_p_content_8h.html"];
  Node25 -> Node2 [color="midnightblue",fontsize="10",style="solid",fontname="Helvetica"];
  Node25 -> Node26 [color="midnightblue",fontsize="10",style="solid",fontname="Helvetica"];
  Node26 [label="future",height=0.2,width=0.4,color="grey75", fillcolor="white", style="filled"];
  Node25 -> Node3 [color="midnightblue",fontsize="10",style="solid",fontname="Helvetica"];
  Node25 -> Node6 [color="midnightblue",fontsize="10",style="solid",fontname="Helvetica"];
  Node25 -> Node27 [color="midnightblue",fontsize="10",style="solid",fontname="Helvetica"];
  Node27 [label="AVSCommon/AVS/Attachment\l/InProcessAttachment.h",height=0.2,width=0.4,color="black", fillcolor="white", style="filled",URL="$_in_process_attachment_8h.html"];
  Node27 -> Node28 [color="midnightblue",fontsize="10",style="solid",fontname="Helvetica"];
  Node28 [label="AVSCommon/AVS/Attachment\l/Attachment.h",height=0.2,width=0.4,color="black", fillcolor="white", style="filled",URL="$_attachment_8h.html"];
  Node28 -> Node12 [color="midnightblue",fontsize="10",style="solid",fontname="Helvetica"];
  Node28 -> Node13 [color="midnightblue",fontsize="10",style="solid",fontname="Helvetica"];
  Node28 -> Node6 [color="midnightblue",fontsize="10",style="solid",fontname="Helvetica"];
  Node28 -> Node29 [color="midnightblue",fontsize="10",style="solid",fontname="Helvetica"];
  Node29 [label="AVSCommon/AVS/Attachment\l/AttachmentReader.h",height=0.2,width=0.4,color="black", fillcolor="white", style="filled",URL="$_attachment_reader_8h.html"];
  Node29 -> Node2 [color="midnightblue",fontsize="10",style="solid",fontname="Helvetica"];
  Node29 -> Node30 [color="midnightblue",fontsize="10",style="solid",fontname="Helvetica"];
  Node30 [label="cstddef",height=0.2,width=0.4,color="grey75", fillcolor="white", style="filled"];
  Node29 -> Node21 [color="midnightblue",fontsize="10",style="solid",fontname="Helvetica"];
  Node29 -> Node31 [color="midnightblue",fontsize="10",style="solid",fontname="Helvetica"];
  Node31 [label="AVSCommon/Utils/SDS\l/ReaderPolicy.h",height=0.2,width=0.4,color="black", fillcolor="white", style="filled",URL="$_reader_policy_8h.html"];
  Node28 -> Node32 [color="midnightblue",fontsize="10",style="solid",fontname="Helvetica"];
  Node32 [label="AVSCommon/AVS/Attachment\l/AttachmentWriter.h",height=0.2,width=0.4,color="black", fillcolor="white", style="filled",URL="$_attachment_writer_8h.html"];
  Node32 -> Node2 [color="midnightblue",fontsize="10",style="solid",fontname="Helvetica"];
  Node32 -> Node30 [color="midnightblue",fontsize="10",style="solid",fontname="Helvetica"];
  Node28 -> Node33 [color="midnightblue",fontsize="10",style="solid",fontname="Helvetica"];
  Node33 [label="AVSCommon/Utils/SDS\l/InProcessSDS.h",height=0.2,width=0.4,color="black", fillcolor="white", style="filled",URL="$_in_process_s_d_s_8h.html"];
  Node33 -> Node15 [color="midnightblue",fontsize="10",style="solid",fontname="Helvetica"];
  Node33 -> Node13 [color="midnightblue",fontsize="10",style="solid",fontname="Helvetica"];
  Node33 -> Node12 [color="midnightblue",fontsize="10",style="solid",fontname="Helvetica"];
  Node33 -> Node34 [color="midnightblue",fontsize="10",style="solid",fontname="Helvetica"];
  Node34 [label="condition_variable",height=0.2,width=0.4,color="grey75", fillcolor="white", style="filled"];
  Node33 -> Node6 [color="midnightblue",fontsize="10",style="solid",fontname="Helvetica"];
  Node33 -> Node35 [color="midnightblue",fontsize="10",style="solid",fontname="Helvetica"];
  Node35 [label="SharedDataStream.h",height=0.2,width=0.4,color="black", fillcolor="white", style="filled",URL="$_shared_data_stream_8h.html"];
  Node35 -> Node36 [color="midnightblue",fontsize="10",style="solid",fontname="Helvetica"];
  Node36 [label="cstdint",height=0.2,width=0.4,color="grey75", fillcolor="white", style="filled"];
  Node35 -> Node30 [color="midnightblue",fontsize="10",style="solid",fontname="Helvetica"];
  Node35 -> Node3 [color="midnightblue",fontsize="10",style="solid",fontname="Helvetica"];
  Node35 -> Node10 [color="midnightblue",fontsize="10",style="solid",fontname="Helvetica"];
  Node35 -> Node37 [color="midnightblue",fontsize="10",style="solid",fontname="Helvetica"];
  Node37 [label="BufferLayout.h",height=0.2,width=0.4,color="black", fillcolor="white", style="filled",URL="$_buffer_layout_8h.html"];
  Node37 -> Node36 [color="midnightblue",fontsize="10",style="solid",fontname="Helvetica"];
  Node37 -> Node30 [color="midnightblue",fontsize="10",style="solid",fontname="Helvetica"];
  Node37 -> Node13 [color="midnightblue",fontsize="10",style="solid",fontname="Helvetica"];
  Node37 -> Node6 [color="midnightblue",fontsize="10",style="solid",fontname="Helvetica"];
  Node37 -> Node15 [color="midnightblue",fontsize="10",style="solid",fontname="Helvetica"];
  Node37 -> Node10 [color="midnightblue",fontsize="10",style="solid",fontname="Helvetica"];
  Node37 -> Node35 [color="midnightblue",fontsize="10",style="solid",fontname="Helvetica"];
  Node35 -> Node38 [color="midnightblue",fontsize="10",style="solid",fontname="Helvetica"];
  Node38 [label="Reader.h",height=0.2,width=0.4,color="black", fillcolor="white", style="filled",URL="$_reader_8h.html"];
  Node38 -> Node36 [color="midnightblue",fontsize="10",style="solid",fontname="Helvetica"];
  Node38 -> Node30 [color="midnightblue",fontsize="10",style="solid",fontname="Helvetica"];
  Node38 -> Node15 [color="midnightblue",fontsize="10",style="solid",fontname="Helvetica"];
  Node38 -> Node13 [color="midnightblue",fontsize="10",style="solid",fontname="Helvetica"];
  Node38 -> Node39 [color="midnightblue",fontsize="10",style="solid",fontname="Helvetica"];
  Node39 [label="limits",height=0.2,width=0.4,color="grey75", fillcolor="white", style="filled"];
  Node38 -> Node40 [color="midnightblue",fontsize="10",style="solid",fontname="Helvetica"];
  Node40 [label="cstring",height=0.2,width=0.4,color="grey75", fillcolor="white", style="filled"];
  Node38 -> Node10 [color="midnightblue",fontsize="10",style="solid",fontname="Helvetica"];
  Node38 -> Node35 [color="midnightblue",fontsize="10",style="solid",fontname="Helvetica"];
  Node38 -> Node31 [color="midnightblue",fontsize="10",style="solid",fontname="Helvetica"];
  Node35 -> Node41 [color="midnightblue",fontsize="10",style="solid",fontname="Helvetica"];
  Node41 [label="Writer.h",height=0.2,width=0.4,color="black", fillcolor="white", style="filled",URL="$_writer_8h.html"];
  Node41 -> Node36 [color="midnightblue",fontsize="10",style="solid",fontname="Helvetica"];
  Node41 -> Node30 [color="midnightblue",fontsize="10",style="solid",fontname="Helvetica"];
  Node41 -> Node15 [color="midnightblue",fontsize="10",style="solid",fontname="Helvetica"];
  Node41 -> Node13 [color="midnightblue",fontsize="10",style="solid",fontname="Helvetica"];
  Node41 -> Node39 [color="midnightblue",fontsize="10",style="solid",fontname="Helvetica"];
  Node41 -> Node40 [color="midnightblue",fontsize="10",style="solid",fontname="Helvetica"];
  Node41 -> Node10 [color="midnightblue",fontsize="10",style="solid",fontname="Helvetica"];
  Node41 -> Node35 [color="midnightblue",fontsize="10",style="solid",fontname="Helvetica"];
  Node41 -> Node42 [color="midnightblue",fontsize="10",style="solid",fontname="Helvetica"];
  Node42 [label="WriterPolicy.h",height=0.2,width=0.4,color="black", fillcolor="white", style="filled",URL="$_writer_policy_8h.html"];
  Node28 -> Node31 [color="midnightblue",fontsize="10",style="solid",fontname="Helvetica"];
  Node28 -> Node42 [color="midnightblue",fontsize="10",style="solid",fontname="Helvetica"];
  Node27 -> Node43 [color="midnightblue",fontsize="10",style="solid",fontname="Helvetica"];
  Node43 [label="AVSCommon/AVS/Attachment\l/InProcessAttachmentReader.h",height=0.2,width=0.4,color="black", fillcolor="white", style="filled",URL="$_in_process_attachment_reader_8h.html"];
  Node43 -> Node33 [color="midnightblue",fontsize="10",style="solid",fontname="Helvetica"];
  Node43 -> Node38 [color="midnightblue",fontsize="10",style="solid",fontname="Helvetica"];
  Node43 -> Node29 [color="midnightblue",fontsize="10",style="solid",fontname="Helvetica"];
  Node27 -> Node44 [color="midnightblue",fontsize="10",style="solid",fontname="Helvetica"];
  Node44 [label="AVSCommon/AVS/Attachment\l/InProcessAttachmentWriter.h",height=0.2,width=0.4,color="black", fillcolor="white", style="filled",URL="$_in_process_attachment_writer_8h.html"];
  Node44 -> Node33 [color="midnightblue",fontsize="10",style="solid",fontname="Helvetica"];
  Node44 -> Node41 [color="midnightblue",fontsize="10",style="solid",fontname="Helvetica"];
  Node44 -> Node32 [color="midnightblue",fontsize="10",style="solid",fontname="Helvetica"];
  Node27 -> Node33 [color="midnightblue",fontsize="10",style="solid",fontname="Helvetica"];
  Node7 -> Node45 [color="midnightblue",fontsize="10",style="solid",fontname="Helvetica"];
  Node45 [label="AVSCommon/Utils/SDKVersion.h",height=0.2,width=0.4,color="black", fillcolor="white", style="filled",URL="$_s_d_k_version_8h.html"];
  Node45 -> Node6 [color="midnightblue",fontsize="10",style="solid",fontname="Helvetica"];
  Node1 -> Node46 [color="midnightblue",fontsize="10",style="solid",fontname="Helvetica"];
  Node46 [label="AVSCommon/Utils/Playlist\lParser/IterativePlaylistParser\lInterface.h",height=0.2,width=0.4,color="black", fillcolor="white", style="filled",URL="$_iterative_playlist_parser_interface_8h.html"];
  Node46 -> Node3 [color="midnightblue",fontsize="10",style="solid",fontname="Helvetica"];
  Node46 -> Node6 [color="midnightblue",fontsize="10",style="solid",fontname="Helvetica"];
  Node46 -> Node15 [color="midnightblue",fontsize="10",style="solid",fontname="Helvetica"];
  Node46 -> Node47 [color="midnightblue",fontsize="10",style="solid",fontname="Helvetica"];
  Node47 [label="PlaylistParserObserverInterface.h",height=0.2,width=0.4,color="black", fillcolor="white", style="filled",URL="$_playlist_parser_observer_interface_8h.html"];
  Node47 -> Node2 [color="midnightblue",fontsize="10",style="solid",fontname="Helvetica"];
  Node47 -> Node21 [color="midnightblue",fontsize="10",style="solid",fontname="Helvetica"];
  Node47 -> Node4 [color="midnightblue",fontsize="10",style="solid",fontname="Helvetica"];
  Node47 -> Node6 [color="midnightblue",fontsize="10",style="solid",fontname="Helvetica"];
  Node47 -> Node48 [color="midnightblue",fontsize="10",style="solid",fontname="Helvetica"];
  Node48 [label="PlaylistEntry.h",height=0.2,width=0.4,color="black", fillcolor="white", style="filled",URL="$_playlist_entry_8h.html"];
  Node48 -> Node2 [color="midnightblue",fontsize="10",style="solid",fontname="Helvetica"];
  Node48 -> Node21 [color="midnightblue",fontsize="10",style="solid",fontname="Helvetica"];
  Node48 -> Node4 [color="midnightblue",fontsize="10",style="solid",fontname="Helvetica"];
  Node48 -> Node6 [color="midnightblue",fontsize="10",style="solid",fontname="Helvetica"];
  Node48 -> Node7 [color="midnightblue",fontsize="10",style="solid",fontname="Helvetica"];
  Node48 -> Node25 [color="midnightblue",fontsize="10",style="solid",fontname="Helvetica"];
  Node1 -> Node49 [color="midnightblue",fontsize="10",style="solid",fontname="Helvetica"];
  Node49 [label="AndroidSLESMediaPlayer\l/FFmpegInputControllerInterface.h",height=0.2,width=0.4,color="black", fillcolor="white", style="filled",URL="$_f_fmpeg_input_controller_interface_8h.html"];
  Node49 -> Node2 [color="midnightblue",fontsize="10",style="solid",fontname="Helvetica"];
  Node49 -> Node21 [color="midnightblue",fontsize="10",style="solid",fontname="Helvetica"];
  Node49 -> Node50 [color="midnightblue",fontsize="10",style="solid",fontname="Helvetica"];
  Node50 [label="tuple",height=0.2,width=0.4,color="grey75", fillcolor="white", style="filled"];
}
