{
    "usage": "This json used for download jlink server.",
    "tools": [
        {
            "description": "Jlink server",
            "info_url": "https://www.segger.com/downloads/jlink/",
            "Can_install": "true",
            "name": "Jlink",
            "versions": [
                {
                    "name": "v6.72e",
                    "status": "uninstalled",
                    "reference_count": 0,
                    "export_paths": [
                        [
                            "Jlink",
                            "v6.72e"
                        ]
                    ],
                    "win32": {
                        "MD5": "null",
                        "size": 0,
                        "url": "https://www.segger.com/downloads/jlink/JLink_Windows_V672e.exe",
                        "unzip": "false",
                        "need_exec": "true"
                    },
                    "linux-amd64": {
                        "MD5": " ",
                        "size": 0,
                        "url": "https://www.segger.com/downloads/jlink/JLink_Linux_V672e_x86_64.deb",
                        "unzip": "false",
                        "need_exec": "true"
                    }
                }
            ]
        }
    ],
    "version": 1
}