{
  "Sdk_Name": "qccsdk_qcc711",
  "Sdk_Ver": "1.1.0",
  "Sdk_Uri": "",
  "outputName": "qccsdk-qcc711.zip",
  "PYTHONPATH": [
    "tools/nvm_programmer/gdb_framework"
  ],
  "demoPath": "./src/demo",
  "need_exec": "false",
  "need_log_in": "false",
  "proxy": true,
  "pythonRequirements": [
    "PyYAML==6.0.1"
  ],
  "sdk_root_path_from_download_path": "./qccsdk-qcc711-1.0.0/qcc711_sdk",
  "unzip": "true",
  "use_git": "false",
  "intr":"Used for QCC711",
  "ver_intr": "",
  "demoChipBoard": "EQM100-5B",
  "Tools": [
    {
      "name": "xpack_arm_gcc",
      "ver": "11.2.1-1.2",
      "uri": {
        "linux-amd64": {
          "MD5": " 63493c0104c565de6dca59b3b90372f0",
          "exe": "false",
          "outputName": "",
          "proxy": true,
          "unzip": "true",
          "url": "https://github.com/xpack-dev-tools/arm-none-eabi-gcc-xpack/releases/download/v11.2.1-1.2/xpack-arm-none-eabi-gcc-11.2.1-1.2-linux-arm64.tar.gz"
        },
        "win32": {
          "MD5": "7fddeaa4a24b2fc1b0486567af9bc301",
          "exe": "false",
          "outputName": "",
          "proxy": true,
          "unzip": "true",
          "url": "https://github.com/xpack-dev-tools/arm-none-eabi-gcc-xpack/releases/download/v11.2.1-1.2/xpack-arm-none-eabi-gcc-11.2.1-1.2-win32-x64.zip"
        }
      },
      "compiler_path": "^xpack_arm_gcc/11.2.1-1.2/xpack-arm-none-eabi-gcc-11.2.1-1.2/bin/arm-none-eabi-gcc",
      "export_paths": [
        "xpack_arm_gcc/11.2.1-1.2/xpack-arm-none-eabi-gcc-11.2.1-1.2/bin"
      ],
      "GDB_CLIENT_PATH": "^xpack_arm_gcc/12.2.1-1.2/xpack-arm-none-eabi-gcc-12.2.1-1.2/bin"
    },
    {
      "name": "python",
      "ver": "3.11.5",
      "uri": {
        "linux-amd64": {
          "MD5": "null",
          "exe": "false",
          "outputName": "",
          "proxy": false,
          "unzip": "true",
          "url": "null"
        },
        "win32": {
          "MD5": "null",
          "exe": "false",
          "outputName": "",
          "proxy": false,
          "unzip": "true",
          "url": "https://www.python.org/ftp/python/3.11.5/python-3.11.5-embed-amd64.zip"
        }
      },
      "export_paths": [
        "Python/3.11.5"
      ],
      "pth_file_name": "python311._pth"
    },
    {
      "name": "QCC711_Openocd",
      "ver": "0.12.0+dev",
      "uri": {
        "linux-amd64": {
          "MD5": "",
          "exe": "false",
          "outputName": "",
          "proxy": true,
          "unzip": "true",
          "url": ""
        },
        "win32": {
          "MD5": "",
          "exe": "false",
          "outputName": "",
          "proxy": true,
          "unzip": "true",
          "url": "https://github.com/seasteh/QCC711_SDK_Patches/raw/master/openocd_ch347.zip",
          "use_git": "false"
        }
      },
      "OPENOCD_PATH": "^QCC711_Openocd/0.12.0+dev/openocd_ch347/bin",
      "export_paths": [
        "QCC711_Openocd/0.12.0+dev/openocd_ch347/bin"
      ]
    },
    {
      "name": "ch347_win_driver",
      "ver": "2.4",
      "uri": {
        "linux-amd64": {
          "MD5": "",
          "exe": "false",
          "outputName": "",
          "proxy": false,
          "unzip": "true",
          "url": ""
        },
        "win32": {
          "MD5": "",
          "exe": "true",
          "outputName": "CH341PAR.EXE",
          "proxy": false,
          "unzip": "false",
          "url": "https://www.wch.cn/downloads/file/64.html"
        }
      },
      "export_paths": []
    },
    {
      "name": "gn",
      "ver": "2121",
      "uri": {
        "linux-amd64": {
          "MD5": "",
          "exe": "false",
          "outputName": "",
          "proxy": true,
          "unzip": "true",
          "url": ""
        },
        "win32": {
          "MD5": "",
          "exe": "false",
          "outputName": "gn-windows-amd64.zip",
          "proxy": true,
          "unzip": "true",
          "url": "https://chrome-infra-packages.appspot.com/dl/gn/gn/windows-amd64/+/latest"
        }
      },
      "export_paths": [
        "gn/2121"
      ]
    },
    {
      "name": "ninja",
      "ver": "1.11.1",
      "uri": {
        "linux-amd64": {
          "MD5": "",
          "exe": "false",
          "outputName": "",
          "proxy": false,
          "unzip": "true",
          "url": ""
        },
        "win32": {
          "MD5": "",
          "exe": "false",
          "outputName": "",
          "proxy": true,
          "unzip": "true",
          "url": "https://github.com/ninja-build/ninja/releases/download/v1.11.1/ninja-win.zip"
        }
      },
      "export_paths": [
        "ninja/1.11.1"
      ]
    }
  ]
}