{
    "signals": {
        "HdmiDetectedFormat": "#S@HdmiConfig#@@#I@StreamConfig#S#DetectedFormat#",
        "SpdifDetectedFormat": "#S@SpdifConfig#@@#I@StreamConfig#S#DetectedFormat#"
    },
    "properties": {
        "HdmiDDPCustomChMap": "#S@HdmiConfig#@@#I@DdpConfig#P#Customchmap#",
        "HdmiDDPLfe": "#S@HdmiConfig#@@#I@DdpConfig#P#Lfeon#",
        "HdmiDDPDualMono": "#S@HdmiConfig#@@#I@DdpConfig#P#Dualmono#"
    },
    "methods": {
        "HdmiDecodeRestart": "#S@HdmiConfig#@@#I@StreamConfig#M#DecodeRestart#"
    }
}