module github.com/quic/csm-device-plugin

go 1.19

require (
        github.com/ghodss/yaml v0.0.0-20150909031657-73d445a93680
        github.com/go-kit/kit v0.9.0
        github.com/mitchellh/mapstructure v1.5.0
        github.com/oklog/run v1.1.0
        github.com/prometheus/client_golang v1.12.1
        github.com/spf13/pflag v1.0.5
        github.com/spf13/viper v1.15.0
        google.golang.org/grpc v1.52.0
        k8s.io/apimachinery v0.20.5
        k8s.io/kubelet v0.20.5
)

require (
        github.com/beorn7/perks v1.0.1 // indirect
        github.com/cespare/xxhash/v2 v2.1.2 // indirect
        github.com/fsnotify/fsnotify v1.6.0 // indirect
        github.com/go-logfmt/logfmt v0.5.1 // indirect
        github.com/gogo/protobuf v1.3.2 // indirect
        github.com/golang/protobuf v1.5.2 // indirect
        github.com/hashicorp/hcl v1.0.0 // indirect
        github.com/magiconair/properties v1.8.7 // indirect
        github.com/matttproud/golang_protobuf_extensions v1.0.2-0.20181231171920-c182affec369 // indirect
        github.com/pelletier/go-toml/v2 v2.0.6 // indirect
        github.com/prometheus/client_model v0.2.0 // indirect
        github.com/prometheus/common v0.36.0 // indirect
        github.com/prometheus/procfs v0.7.3 // indirect
        github.com/spf13/afero v1.9.3 // indirect
        github.com/spf13/cast v1.5.0 // indirect
        github.com/spf13/jwalterweatherman v1.1.0 // indirect
        github.com/subosito/gotenv v1.4.2 // indirect
        golang.org/x/net v0.7.0 // indirect
        golang.org/x/sys v0.5.0 // indirect
        golang.org/x/text v0.7.0 // indirect
        google.golang.org/genproto v0.0.0-20221227171554-f9683d7f8bef // indirect
        google.golang.org/protobuf v1.28.1 // indirect
        gopkg.in/ini.v1 v1.67.0 // indirect
        gopkg.in/yaml.v2 v2.4.0 // indirect
        gopkg.in/yaml.v3 v3.0.1 // indirect
)
