###############################################################
Seconds: 0
Active subflow num: 1
----------------------------------------------------------------
Subflow id: 1
Sending target: 500000 | weight: 1.000000
128->sent_bytes:0 (L:(nil),R:(nil)) subflows:1 
###############################################################
Seconds: 0
Active subflow num: 1
----------------------------------------------------------------
Subflow id: 1
Sending target: 500000 | weight: 1.000000
128->sent_bytes:0 (L:(nil),R:(nil)) subflows:1 
###############################################################
Seconds: 0
Active subflow num: 1
----------------------------------------------------------------
Subflow id: 1
Sending target: 500000 | weight: 1.000000
128->sent_bytes:0 (L:(nil),R:(nil)) subflows:1 
###############################################################
Seconds: 1
Active subflow num: 1
----------------------------------------------------------------
Subflow id: 1
Sending target: 500000 | weight: 1.000000
128->sent_bytes:0 (L:(nil),R:(nil)) subflows:1 
###############################################################
Seconds: 2
Active subflow num: 1
----------------------------------------------------------------
Subflow id: 1
Sending target: 591136 | weight: 1.000000
128->sent_bytes:0 (L:(nil),R:(nil)) subflows:1 
###############################################################
Seconds: 3
Active subflow num: 1
----------------------------------------------------------------
Subflow id: 1
Sending target: 695244 | weight: 1.000000
128->sent_bytes:0 (L:(nil),R:(nil)) subflows:1 
###############################################################
Seconds: 3
Active subflow num: 1
----------------------------------------------------------------
Subflow id: 1
Sending target: 762560 | weight: 1.000000
128->sent_bytes:0 (L:(nil),R:(nil)) subflows:1 
###############################################################
Seconds: 5
Active subflow num: 1
----------------------------------------------------------------
Subflow id: 1
Sending target: 762560 | weight: 1.000000
128->sent_bytes:0 (L:(nil),R:(nil)) subflows:1 
###############################################################
Seconds: 5
Active subflow num: 1
----------------------------------------------------------------
Subflow id: 1
Sending target: 922116 | weight: 1.000000
128->sent_bytes:0 (L:(nil),R:(nil)) subflows:1 
###############################################################
Seconds: 5
Active subflow num: 1
----------------------------------------------------------------
Subflow id: 1
Sending target: 724043 | weight: 1.000000
128->sent_bytes:0 (L:(nil),R:(nil)) subflows:1 
###############################################################
Seconds: 6
Active subflow num: 1
----------------------------------------------------------------
Subflow id: 1
Sending target: 724043 | weight: 1.000000
128->sent_bytes:0 (L:(nil),R:(nil)) subflows:1 
###############################################################
Seconds: 7
Active subflow num: 1
----------------------------------------------------------------
Subflow id: 1
Sending target: 724043 | weight: 1.000000
128->sent_bytes:0 (L:(nil),R:(nil)) subflows:1 
###############################################################
Seconds: 8
Active subflow num: 1
----------------------------------------------------------------
Subflow id: 1
Sending target: 781003 | weight: 1.000000
128->sent_bytes:0 (L:(nil),R:(nil)) subflows:1 
###############################################################
Seconds: 9
Active subflow num: 1
----------------------------------------------------------------
Subflow id: 1
Sending target: 837963 | weight: 1.000000
128->sent_bytes:0 (L:(nil),R:(nil)) subflows:1 
###############################################################
Seconds: 10
Active subflow num: 1
----------------------------------------------------------------
Subflow id: 1
Sending target: 705616 | weight: 1.000000
128->sent_bytes:0 (L:(nil),R:(nil)) subflows:1 
###############################################################
Seconds: 11
Active subflow num: 1
----------------------------------------------------------------
Subflow id: 1
Sending target: 705616 | weight: 1.000000
128->sent_bytes:0 (L:(nil),R:(nil)) subflows:1 
###############################################################
Seconds: 12
Active subflow num: 1
----------------------------------------------------------------
Subflow id: 1
Sending target: 705616 | weight: 1.000000
128->sent_bytes:0 (L:(nil),R:(nil)) subflows:1 
###############################################################
Seconds: 12
Active subflow num: 1
----------------------------------------------------------------
Subflow id: 1
Sending target: 705616 | weight: 1.000000
128->sent_bytes:0 (L:(nil),R:(nil)) subflows:1 
###############################################################
Seconds: 13
Active subflow num: 1
----------------------------------------------------------------
Subflow id: 1
Sending target: 705616 | weight: 1.000000
128->sent_bytes:0 (L:(nil),R:(nil)) subflows:1 
###############################################################
Seconds: 13
Active subflow num: 1
----------------------------------------------------------------
Subflow id: 1
Sending target: 762576 | weight: 1.000000
128->sent_bytes:0 (L:(nil),R:(nil)) subflows:1 
###############################################################
Seconds: 14
Active subflow num: 1
----------------------------------------------------------------
Subflow id: 1
Sending target: 762576 | weight: 1.000000
128->sent_bytes:0 (L:(nil),R:(nil)) subflows:1 
###############################################################
Seconds: 15
Active subflow num: 1
----------------------------------------------------------------
Subflow id: 1
Sending target: 819536 | weight: 1.000000
128->sent_bytes:0 (L:(nil),R:(nil)) subflows:1 
###############################################################
Seconds: 15
Active subflow num: 1
----------------------------------------------------------------
Subflow id: 1
Sending target: 819536 | weight: 1.000000
128->sent_bytes:0 (L:(nil),R:(nil)) subflows:1 
###############################################################
Seconds: 17
Active subflow num: 1
----------------------------------------------------------------
Subflow id: 1
Sending target: 847160 | weight: 1.000000
128->sent_bytes:0 (L:(nil),R:(nil)) subflows:1 
###############################################################
Seconds: 17
Active subflow num: 1
----------------------------------------------------------------
Subflow id: 1
Sending target: 926904 | weight: 1.000000
128->sent_bytes:0 (L:(nil),R:(nil)) subflows:1 
###############################################################
Seconds: 19
Active subflow num: 1
----------------------------------------------------------------
Subflow id: 1
Sending target: 1006452 | weight: 1.000000
128->sent_bytes:0 (L:(nil),R:(nil)) subflows:1 
###############################################################
Seconds: 19
Active subflow num: 1
----------------------------------------------------------------
Subflow id: 1
Sending target: 823041 | weight: 1.000000
128->sent_bytes:0 (L:(nil),R:(nil)) subflows:1 
###############################################################
Seconds: 20
Active subflow num: 1
----------------------------------------------------------------
Subflow id: 1
Sending target: 823041 | weight: 1.000000
128->sent_bytes:0 (L:(nil),R:(nil)) subflows:1 
###############################################################
Seconds: 20
Active subflow num: 1
----------------------------------------------------------------
Subflow id: 1
Sending target: 823041 | weight: 1.000000
128->sent_bytes:0 (L:(nil),R:(nil)) subflows:1 
###############################################################
Seconds: 22
Active subflow num: 1
----------------------------------------------------------------
Subflow id: 1
Sending target: 823041 | weight: 1.000000
128->sent_bytes:0 (L:(nil),R:(nil)) subflows:1 
###############################################################
Seconds: 22
Active subflow num: 1
----------------------------------------------------------------
Subflow id: 1
Sending target: 891393 | weight: 1.000000
128->sent_bytes:0 (L:(nil),R:(nil)) subflows:1 
###############################################################
Seconds: 23
Active subflow num: 1
----------------------------------------------------------------
Subflow id: 1
Sending target: 891393 | weight: 1.000000
128->sent_bytes:0 (L:(nil),R:(nil)) subflows:1 
###############################################################
Seconds: 23
Active subflow num: 1
----------------------------------------------------------------
Subflow id: 1
Sending target: 941544 | weight: 1.000000
128->sent_bytes:0 (L:(nil),R:(nil)) subflows:1 
###############################################################
Seconds: 24
Active subflow num: 1
----------------------------------------------------------------
Subflow id: 1
Sending target: 941544 | weight: 1.000000
128->sent_bytes:0 (L:(nil),R:(nil)) subflows:1 
###############################################################
Seconds: 25
Active subflow num: 1
----------------------------------------------------------------
Subflow id: 1
Sending target: 1006848 | weight: 1.000000
128->sent_bytes:0 (L:(nil),R:(nil)) subflows:1 
###############################################################
Seconds: 26
Active subflow num: 1
----------------------------------------------------------------
Subflow id: 1
Sending target: 1006848 | weight: 1.000000
128->sent_bytes:0 (L:(nil),R:(nil)) subflows:1 
###############################################################
Seconds: 26
Active subflow num: 1
----------------------------------------------------------------
Subflow id: 1
Sending target: 1086592 | weight: 1.000000
128->sent_bytes:0 (L:(nil),R:(nil)) subflows:1 
###############################################################
Seconds: 27
Active subflow num: 1
----------------------------------------------------------------
Subflow id: 1
Sending target: 1086592 | weight: 1.000000
128->sent_bytes:0 (L:(nil),R:(nil)) subflows:1 
###############################################################
Seconds: 28
Active subflow num: 1
----------------------------------------------------------------
Subflow id: 1
Sending target: 1189120 | weight: 1.000000
128->sent_bytes:0 (L:(nil),R:(nil)) subflows:1 
###############################################################
Seconds: 29
Active subflow num: 1
----------------------------------------------------------------
Subflow id: 1
Sending target: 1189120 | weight: 1.000000
128->sent_bytes:0 (L:(nil),R:(nil)) subflows:1 
###############################################################
Seconds: 29
Active subflow num: 1
----------------------------------------------------------------
Subflow id: 1
Sending target: 1371392 | weight: 1.000000
128->sent_bytes:0 (L:(nil),R:(nil)) subflows:1 
###############################################################
Seconds: 30
Active subflow num: 1
----------------------------------------------------------------
Subflow id: 1
Sending target: 1371392 | weight: 1.000000
128->sent_bytes:0 (L:(nil),R:(nil)) subflows:1 
###############################################################
Seconds: 31
Active subflow num: 1
----------------------------------------------------------------
Subflow id: 1
Sending target: 1496136 | weight: 1.000000
128->sent_bytes:0 (L:(nil),R:(nil)) subflows:1 
###############################################################
Seconds: 32
Active subflow num: 1
----------------------------------------------------------------
Subflow id: 1
Sending target: 1643152 | weight: 1.000000
128->sent_bytes:0 (L:(nil),R:(nil)) subflows:1 
###############################################################
Seconds: 32
Active subflow num: 1
----------------------------------------------------------------
Subflow id: 1
Sending target: 1643152 | weight: 1.000000
128->sent_bytes:0 (L:(nil),R:(nil)) subflows:1 
###############################################################
Seconds: 33
Active subflow num: 1
----------------------------------------------------------------
Subflow id: 1
Sending target: 1753384 | weight: 1.000000
128->sent_bytes:0 (L:(nil),R:(nil)) subflows:1 
###############################################################
Seconds: 33
Active subflow num: 1
----------------------------------------------------------------
Subflow id: 1
Sending target: 1753384 | weight: 1.000000
128->sent_bytes:0 (L:(nil),R:(nil)) subflows:1 
###############################################################
Seconds: 34
Active subflow num: 1
----------------------------------------------------------------
Subflow id: 1
Sending target: 1927464 | weight: 1.000000
128->sent_bytes:0 (L:(nil),R:(nil)) subflows:1 
###############################################################
Seconds: 35
Active subflow num: 1
----------------------------------------------------------------
Subflow id: 1
Sending target: 1988504 | weight: 1.000000
128->sent_bytes:0 (L:(nil),R:(nil)) subflows:1 
###############################################################
Seconds: 36
Active subflow num: 1
----------------------------------------------------------------
Subflow id: 1
Sending target: 2219208 | weight: 1.000000
128->sent_bytes:0 (L:(nil),R:(nil)) subflows:1 
###############################################################
Seconds: 37
Active subflow num: 1
----------------------------------------------------------------
Subflow id: 1
Sending target: 2219208 | weight: 1.000000
128->sent_bytes:0 (L:(nil),R:(nil)) subflows:1 
###############################################################
Seconds: 38
Active subflow num: 1
----------------------------------------------------------------
Subflow id: 1
Sending target: 2192180 | weight: 1.000000
128->sent_bytes:0 (L:(nil),R:(nil)) subflows:1 
###############################################################
Seconds: 38
Active subflow num: 1
----------------------------------------------------------------
Subflow id: 1
Sending target: 2442804 | weight: 1.000000
128->sent_bytes:0 (L:(nil),R:(nil)) subflows:1 
###############################################################
Seconds: 38
Active subflow num: 1
----------------------------------------------------------------
Subflow id: 1
Sending target: 1999956 | weight: 1.000000
128->sent_bytes:0 (L:(nil),R:(nil)) subflows:1 
###############################################################
Seconds: 40
Active subflow num: 1
----------------------------------------------------------------
Subflow id: 1
Sending target: 1999956 | weight: 1.000000
128->sent_bytes:0 (L:(nil),R:(nil)) subflows:1 
###############################################################
Seconds: 40
Active subflow num: 1
----------------------------------------------------------------
Subflow id: 1
Sending target: 1619873 | weight: 1.000000
128->sent_bytes:0 (L:(nil),R:(nil)) subflows:1 
###############################################################
Seconds: 41
Active subflow num: 1
----------------------------------------------------------------
Subflow id: 1
Sending target: 1619873 | weight: 1.000000
128->sent_bytes:0 (L:(nil),R:(nil)) subflows:1 
###############################################################
Seconds: 41
Active subflow num: 1
----------------------------------------------------------------
Subflow id: 1
Sending target: 742581 | weight: 1.000000
128->sent_bytes:0 (L:(nil),R:(nil)) subflows:1 
###############################################################
Seconds: 41
Active subflow num: 1
----------------------------------------------------------------
Subflow id: 1
Sending target: 742581 | weight: 1.000000
128->sent_bytes:0 (L:(nil),R:(nil)) subflows:1 
###############################################################
Seconds: 41
Active subflow num: 1
----------------------------------------------------------------
Subflow id: 1
Sending target: 742581 | weight: 1.000000
128->sent_bytes:0 (L:(nil),R:(nil)) subflows:1 
###############################################################
Seconds: 41
Active subflow num: 1
----------------------------------------------------------------
Subflow id: 1
Sending target: 742581 | weight: 1.000000
128->sent_bytes:0 (L:(nil),R:(nil)) subflows:1 
###############################################################
Seconds: 41
Active subflow num: 1
----------------------------------------------------------------
Subflow id: 1
Sending target: 356520 | weight: 1.000000
128->sent_bytes:0 (L:(nil),R:(nil)) subflows:1 
###############################################################
Seconds: 41
Active subflow num: 1
----------------------------------------------------------------
Subflow id: 1
Sending target: 356520 | weight: 1.000000
128->sent_bytes:0 (L:(nil),R:(nil)) subflows:1 
###############################################################
Seconds: 42
Active subflow num: 1
----------------------------------------------------------------
Subflow id: 1
Sending target: 356520 | weight: 1.000000
128->sent_bytes:0 (L:(nil),R:(nil)) subflows:1 
###############################################################
Seconds: 42
Active subflow num: 1
----------------------------------------------------------------
Subflow id: 1
Sending target: 356520 | weight: 1.000000
128->sent_bytes:0 (L:(nil),R:(nil)) subflows:1 
###############################################################
Seconds: 42
Active subflow num: 1
----------------------------------------------------------------
Subflow id: 1
Sending target: 356520 | weight: 1.000000
128->sent_bytes:0 (L:(nil),R:(nil)) subflows:1 
###############################################################
Seconds: 42
Active subflow num: 1
----------------------------------------------------------------
Subflow id: 1
Sending target: 356520 | weight: 1.000000
128->sent_bytes:0 (L:(nil),R:(nil)) subflows:1 
###############################################################
Seconds: 42
Active subflow num: 1
----------------------------------------------------------------
Subflow id: 1
Sending target: 356520 | weight: 1.000000
128->sent_bytes:0 (L:(nil),R:(nil)) subflows:1 
###############################################################
Seconds: 42
Active subflow num: 1
----------------------------------------------------------------
Subflow id: 1
Sending target: 356520 | weight: 1.000000
128->sent_bytes:0 (L:(nil),R:(nil)) subflows:1 
###############################################################
Seconds: 42
Active subflow num: 1
----------------------------------------------------------------
Subflow id: 1
Sending target: 356520 | weight: 1.000000
128->sent_bytes:0 (L:(nil),R:(nil)) subflows:1 
###############################################################
Seconds: 42
Active subflow num: 1
----------------------------------------------------------------
Subflow id: 1
Sending target: 356520 | weight: 1.000000
128->sent_bytes:0 (L:(nil),R:(nil)) subflows:1 
###############################################################
Seconds: 43
Active subflow num: 1
----------------------------------------------------------------
Subflow id: 1
Sending target: 356520 | weight: 1.000000
128->sent_bytes:0 (L:(nil),R:(nil)) subflows:1 
###############################################################
Seconds: 43
Active subflow num: 1
----------------------------------------------------------------
Subflow id: 1
Sending target: 356520 | weight: 1.000000
128->sent_bytes:0 (L:(nil),R:(nil)) subflows:1 
###############################################################
Seconds: 43
Active subflow num: 1
----------------------------------------------------------------
Subflow id: 1
Sending target: 356520 | weight: 1.000000
128->sent_bytes:0 (L:(nil),R:(nil)) subflows:1 
###############################################################
Seconds: 43
Active subflow num: 1
----------------------------------------------------------------
Subflow id: 1
Sending target: 356520 | weight: 1.000000
128->sent_bytes:0 (L:(nil),R:(nil)) subflows:1 
###############################################################
Seconds: 43
Active subflow num: 1
----------------------------------------------------------------
Subflow id: 1
Sending target: 356520 | weight: 1.000000
128->sent_bytes:0 (L:(nil),R:(nil)) subflows:1 
###############################################################
Seconds: 44
Active subflow num: 1
----------------------------------------------------------------
Subflow id: 1
Sending target: 356520 | weight: 1.000000
128->sent_bytes:0 (L:(nil),R:(nil)) subflows:1 
###############################################################
Seconds: 45
Active subflow num: 1
----------------------------------------------------------------
Subflow id: 1
Sending target: 356520 | weight: 1.000000
128->sent_bytes:0 (L:(nil),R:(nil)) subflows:1 
###############################################################
Seconds: 46
Active subflow num: 1
----------------------------------------------------------------
Subflow id: 1
Sending target: 430568 | weight: 1.000000
128->sent_bytes:0 (L:(nil),R:(nil)) subflows:1 
###############################################################
Seconds: 46
Active subflow num: 1
----------------------------------------------------------------
Subflow id: 1
Sending target: 343685 | weight: 1.000000
128->sent_bytes:0 (L:(nil),R:(nil)) subflows:1 
###############################################################
Seconds: 47
Active subflow num: 1
----------------------------------------------------------------
Subflow id: 1
Sending target: 343685 | weight: 1.000000
128->sent_bytes:0 (L:(nil),R:(nil)) subflows:1 
###############################################################
Seconds: 47
Active subflow num: 1
----------------------------------------------------------------
Subflow id: 1
Sending target: 343685 | weight: 1.000000
128->sent_bytes:0 (L:(nil),R:(nil)) subflows:1 
###############################################################
Seconds: 47
Active subflow num: 1
----------------------------------------------------------------
Subflow id: 1
Sending target: 343685 | weight: 1.000000
128->sent_bytes:0 (L:(nil),R:(nil)) subflows:1 
###############################################################
Seconds: 48
Active subflow num: 1
----------------------------------------------------------------
Subflow id: 1
Sending target: 300709 | weight: 1.000000
128->sent_bytes:0 (L:(nil),R:(nil)) subflows:1 
###############################################################
Seconds: 49
Active subflow num: 1
----------------------------------------------------------------
Subflow id: 1
Sending target: 299787 | weight: 1.000000
128->sent_bytes:0 (L:(nil),R:(nil)) subflows:1 
###############################################################
Seconds: 50
Active subflow num: 1
----------------------------------------------------------------
Subflow id: 1
Sending target: 260950 | weight: 1.000000
128->sent_bytes:0 (L:(nil),R:(nil)) subflows:1 
###############################################################
Seconds: 51
Active subflow num: 1
----------------------------------------------------------------
Subflow id: 1
Sending target: 259147 | weight: 1.000000
128->sent_bytes:0 (L:(nil),R:(nil)) subflows:1 
###############################################################
Seconds: 52
Active subflow num: 1
----------------------------------------------------------------
Subflow id: 1
Sending target: 255669 | weight: 1.000000
128->sent_bytes:0 (L:(nil),R:(nil)) subflows:1 
###############################################################
Seconds: 53
Active subflow num: 1
----------------------------------------------------------------
Subflow id: 1
Sending target: 253951 | weight: 1.000000
128->sent_bytes:0 (L:(nil),R:(nil)) subflows:1 
###############################################################
Seconds: 54
Active subflow num: 1
----------------------------------------------------------------
Subflow id: 1
Sending target: 253951 | weight: 1.000000
128->sent_bytes:0 (L:(nil),R:(nil)) subflows:1 
###############################################################
Seconds: 55
Active subflow num: 1
----------------------------------------------------------------
Subflow id: 1
Sending target: 253951 | weight: 1.000000
128->sent_bytes:0 (L:(nil),R:(nil)) subflows:1 
###############################################################
Seconds: 56
Active subflow num: 1
----------------------------------------------------------------
Subflow id: 1
Sending target: 312855 | weight: 1.000000
128->sent_bytes:0 (L:(nil),R:(nil)) subflows:1 
###############################################################
Seconds: 57
Active subflow num: 1
----------------------------------------------------------------
Subflow id: 1
Sending target: 353364 | weight: 1.000000
128->sent_bytes:0 (L:(nil),R:(nil)) subflows:1 
###############################################################
Seconds: 58
Active subflow num: 1
----------------------------------------------------------------
Subflow id: 1
Sending target: 385388 | weight: 1.000000
128->sent_bytes:0 (L:(nil),R:(nil)) subflows:1 
###############################################################
Seconds: 59
Active subflow num: 1
----------------------------------------------------------------
Subflow id: 1
Sending target: 444348 | weight: 1.000000
128->sent_bytes:0 (L:(nil),R:(nil)) subflows:1 
###############################################################
Seconds: 60
Active subflow num: 1
----------------------------------------------------------------
Subflow id: 1
Sending target: 483924 | weight: 1.000000
128->sent_bytes:0 (L:(nil),R:(nil)) subflows:1 
###############################################################
Seconds: 60
Active subflow num: 1
----------------------------------------------------------------
Subflow id: 1
Sending target: 483924 | weight: 1.000000
128->sent_bytes:0 (L:(nil),R:(nil)) subflows:1 
###############################################################
Seconds: 61
Active subflow num: 1
----------------------------------------------------------------
Subflow id: 1
Sending target: 522128 | weight: 1.000000
128->sent_bytes:0 (L:(nil),R:(nil)) subflows:1 
###############################################################
Seconds: 61
Active subflow num: 1
----------------------------------------------------------------
Subflow id: 1
Sending target: 522128 | weight: 1.000000
128->sent_bytes:0 (L:(nil),R:(nil)) subflows:1 
###############################################################
Seconds: 61
Active subflow num: 1
----------------------------------------------------------------
Subflow id: 1
Sending target: 565912 | weight: 1.000000
128->sent_bytes:0 (L:(nil),R:(nil)) subflows:1 
###############################################################
Seconds: 62
Active subflow num: 1
----------------------------------------------------------------
Subflow id: 1
Sending target: 609664 | weight: 1.000000
128->sent_bytes:0 (L:(nil),R:(nil)) subflows:1 
###############################################################
Seconds: 63
Active subflow num: 1
----------------------------------------------------------------
Subflow id: 1
Sending target: 609664 | weight: 1.000000
128->sent_bytes:0 (L:(nil),R:(nil)) subflows:1 
###############################################################
Seconds: 63
Active subflow num: 1
----------------------------------------------------------------
Subflow id: 1
Sending target: 643348 | weight: 1.000000
128->sent_bytes:0 (L:(nil),R:(nil)) subflows:1 
###############################################################
Seconds: 64
Active subflow num: 1
----------------------------------------------------------------
Subflow id: 1
Sending target: 703808 | weight: 1.000000
128->sent_bytes:0 (L:(nil),R:(nil)) subflows:1 
###############################################################
Seconds: 65
Active subflow num: 1
----------------------------------------------------------------
Subflow id: 1
Sending target: 747024 | weight: 1.000000
128->sent_bytes:0 (L:(nil),R:(nil)) subflows:1 
###############################################################
Seconds: 66
Active subflow num: 1
----------------------------------------------------------------
Subflow id: 1
Sending target: 849552 | weight: 1.000000
128->sent_bytes:0 (L:(nil),R:(nil)) subflows:1 
###############################################################
Seconds: 67
Active subflow num: 1
----------------------------------------------------------------
Subflow id: 1
Sending target: 849552 | weight: 1.000000
128->sent_bytes:0 (L:(nil),R:(nil)) subflows:1 
###############################################################
Seconds: 67
Active subflow num: 1
----------------------------------------------------------------
Subflow id: 1
Sending target: 900704 | weight: 1.000000
128->sent_bytes:0 (L:(nil),R:(nil)) subflows:1 
###############################################################
Seconds: 68
Active subflow num: 1
----------------------------------------------------------------
Subflow id: 1
Sending target: 979632 | weight: 1.000000
128->sent_bytes:0 (L:(nil),R:(nil)) subflows:1 
###############################################################
Seconds: 68
Active subflow num: 1
----------------------------------------------------------------
Subflow id: 1
Sending target: 779263 | weight: 1.000000
128->sent_bytes:0 (L:(nil),R:(nil)) subflows:1 
###############################################################
Seconds: 70
Active subflow num: 1
----------------------------------------------------------------
Subflow id: 1
Sending target: 779207 | weight: 1.000000
128->sent_bytes:0 (L:(nil),R:(nil)) subflows:1 
###############################################################
Seconds: 71
Active subflow num: 1
----------------------------------------------------------------
Subflow id: 1
Sending target: 779179 | weight: 1.000000
128->sent_bytes:0 (L:(nil),R:(nil)) subflows:1 
###############################################################
Seconds: 72
Active subflow num: 1
----------------------------------------------------------------
Subflow id: 1
Sending target: 779179 | weight: 1.000000
128->sent_bytes:0 (L:(nil),R:(nil)) subflows:1 
###############################################################
Seconds: 72
Active subflow num: 1
----------------------------------------------------------------
Subflow id: 1
Sending target: 779179 | weight: 1.000000
128->sent_bytes:0 (L:(nil),R:(nil)) subflows:1 
###############################################################
Seconds: 73
Active subflow num: 1
----------------------------------------------------------------
Subflow id: 1
Sending target: 832604 | weight: 1.000000
128->sent_bytes:0 (L:(nil),R:(nil)) subflows:1 
###############################################################
Seconds: 74
Active subflow num: 1
----------------------------------------------------------------
Subflow id: 1
Sending target: 832604 | weight: 1.000000
128->sent_bytes:0 (L:(nil),R:(nil)) subflows:1 
###############################################################
Seconds: 75
Active subflow num: 1
----------------------------------------------------------------
Subflow id: 1
Sending target: 900956 | weight: 1.000000
128->sent_bytes:0 (L:(nil),R:(nil)) subflows:1 
###############################################################
Seconds: 76
Active subflow num: 1
----------------------------------------------------------------
Subflow id: 1
Sending target: 900956 | weight: 1.000000
128->sent_bytes:0 (L:(nil),R:(nil)) subflows:1 
###############################################################
Seconds: 77
Active subflow num: 1
----------------------------------------------------------------
Subflow id: 1
Sending target: 949480 | weight: 1.000000
128->sent_bytes:0 (L:(nil),R:(nil)) subflows:1 
###############################################################
Seconds: 77
Active subflow num: 1
----------------------------------------------------------------
Subflow id: 1
Sending target: 792953 | weight: 1.000000
128->sent_bytes:0 (L:(nil),R:(nil)) subflows:1 
###############################################################
Seconds: 78
Active subflow num: 1
----------------------------------------------------------------
Subflow id: 1
Sending target: 792953 | weight: 1.000000
128->sent_bytes:0 (L:(nil),R:(nil)) subflows:1 
###############################################################
Seconds: 79
Active subflow num: 1
----------------------------------------------------------------
Subflow id: 1
Sending target: 792953 | weight: 1.000000
128->sent_bytes:0 (L:(nil),R:(nil)) subflows:1 
###############################################################
Seconds: 79
Active subflow num: 1
----------------------------------------------------------------
Subflow id: 1
Sending target: 792953 | weight: 1.000000
128->sent_bytes:0 (L:(nil),R:(nil)) subflows:1 
###############################################################
Seconds: 80
Active subflow num: 1
----------------------------------------------------------------
Subflow id: 1
Sending target: 861305 | weight: 1.000000
128->sent_bytes:0 (L:(nil),R:(nil)) subflows:1 
###############################################################
Seconds: 81
Active subflow num: 1
----------------------------------------------------------------
Subflow id: 1
Sending target: 861305 | weight: 1.000000
128->sent_bytes:0 (L:(nil),R:(nil)) subflows:1 
###############################################################
Seconds: 82
Active subflow num: 1
----------------------------------------------------------------
Subflow id: 1
Sending target: 929657 | weight: 1.000000
128->sent_bytes:0 (L:(nil),R:(nil)) subflows:1 
###############################################################
Seconds: 83
Active subflow num: 1
----------------------------------------------------------------
Subflow id: 1
Sending target: 929657 | weight: 1.000000
128->sent_bytes:0 (L:(nil),R:(nil)) subflows:1 
###############################################################
Seconds: 84
Active subflow num: 1
----------------------------------------------------------------
Subflow id: 1
Sending target: 963248 | weight: 1.000000
128->sent_bytes:0 (L:(nil),R:(nil)) subflows:1 
###############################################################
Seconds: 84
Active subflow num: 1
----------------------------------------------------------------
Subflow id: 1
Sending target: 798525 | weight: 1.000000
128->sent_bytes:0 (L:(nil),R:(nil)) subflows:1 
###############################################################
Seconds: 85
Active subflow num: 1
----------------------------------------------------------------
Subflow id: 1
Sending target: 798525 | weight: 1.000000
128->sent_bytes:0 (L:(nil),R:(nil)) subflows:1 
###############################################################
Seconds: 86
Active subflow num: 1
----------------------------------------------------------------
Subflow id: 1
Sending target: 798525 | weight: 1.000000
128->sent_bytes:0 (L:(nil),R:(nil)) subflows:1 
###############################################################
Seconds: 86
Active subflow num: 1
----------------------------------------------------------------
Subflow id: 1
Sending target: 798525 | weight: 1.000000
128->sent_bytes:0 (L:(nil),R:(nil)) subflows:1 
###############################################################
Seconds: 87
Active subflow num: 1
----------------------------------------------------------------
Subflow id: 1
Sending target: 866877 | weight: 1.000000
128->sent_bytes:0 (L:(nil),R:(nil)) subflows:1 
###############################################################
Seconds: 88
Active subflow num: 1
----------------------------------------------------------------
Subflow id: 1
Sending target: 866877 | weight: 1.000000
128->sent_bytes:0 (L:(nil),R:(nil)) subflows:1 
###############################################################
Seconds: 89
Active subflow num: 1
----------------------------------------------------------------
Subflow id: 1
Sending target: 877032 | weight: 1.000000
128->sent_bytes:0 (L:(nil),R:(nil)) subflows:1 
###############################################################
Seconds: 90
Active subflow num: 1
----------------------------------------------------------------
Subflow id: 1
Sending target: 945384 | weight: 1.000000
128->sent_bytes:0 (L:(nil),R:(nil)) subflows:1 
###############################################################
Seconds: 91
Active subflow num: 1
----------------------------------------------------------------
Subflow id: 1
Sending target: 945384 | weight: 1.000000
128->sent_bytes:0 (L:(nil),R:(nil)) subflows:1 
###############################################################
Seconds: 91
Active subflow num: 1
----------------------------------------------------------------
Subflow id: 1
Sending target: 791186 | weight: 1.000000
128->sent_bytes:0 (L:(nil),R:(nil)) subflows:1 
###############################################################
Seconds: 92
Active subflow num: 1
----------------------------------------------------------------
Subflow id: 1
Sending target: 791186 | weight: 1.000000
128->sent_bytes:0 (L:(nil),R:(nil)) subflows:1 
###############################################################
Seconds: 93
Active subflow num: 1
----------------------------------------------------------------
Subflow id: 1
Sending target: 791186 | weight: 1.000000
128->sent_bytes:0 (L:(nil),R:(nil)) subflows:1 
###############################################################
Seconds: 94
Active subflow num: 1
----------------------------------------------------------------
Subflow id: 1
Sending target: 791186 | weight: 1.000000
128->sent_bytes:0 (L:(nil),R:(nil)) subflows:1 
###############################################################
Seconds: 94
Active subflow num: 1
----------------------------------------------------------------
Subflow id: 1
Sending target: 848146 | weight: 1.000000
128->sent_bytes:0 (L:(nil),R:(nil)) subflows:1 
###############################################################
Seconds: 95
Active subflow num: 1
----------------------------------------------------------------
Subflow id: 1
Sending target: 848146 | weight: 1.000000
128->sent_bytes:0 (L:(nil),R:(nil)) subflows:1 
###############################################################
Seconds: 96
Active subflow num: 1
----------------------------------------------------------------
Subflow id: 1
Sending target: 916498 | weight: 1.000000
128->sent_bytes:0 (L:(nil),R:(nil)) subflows:1 
###############################################################
Seconds: 97
Active subflow num: 1
----------------------------------------------------------------
Subflow id: 1
Sending target: 916498 | weight: 1.000000
128->sent_bytes:0 (L:(nil),R:(nil)) subflows:1 
###############################################################
Seconds: 98
Active subflow num: 1
----------------------------------------------------------------
Subflow id: 1
Sending target: 939768 | weight: 1.000000
128->sent_bytes:0 (L:(nil),R:(nil)) subflows:1 
###############################################################
Seconds: 98
Active subflow num: 1
----------------------------------------------------------------
Subflow id: 1
Sending target: 794833 | weight: 1.000000
128->sent_bytes:0 (L:(nil),R:(nil)) subflows:1 
###############################################################
Seconds: 99
Active subflow num: 1
----------------------------------------------------------------
Subflow id: 1
Sending target: 794833 | weight: 1.000000
128->sent_bytes:0 (L:(nil),R:(nil)) subflows:1 
###############################################################
Seconds: 101
Active subflow num: 1
----------------------------------------------------------------
Subflow id: 1
Sending target: 794833 | weight: 1.000000
128->sent_bytes:0 (L:(nil),R:(nil)) subflows:1 
###############################################################
Seconds: 101
Active subflow num: 1
----------------------------------------------------------------
Subflow id: 1
Sending target: 863185 | weight: 1.000000
128->sent_bytes:0 (L:(nil),R:(nil)) subflows:1 
###############################################################
Seconds: 102
Active subflow num: 1
----------------------------------------------------------------
Subflow id: 1
Sending target: 931537 | weight: 1.000000
128->sent_bytes:0 (L:(nil),R:(nil)) subflows:1 
###############################################################
Seconds: 103
Active subflow num: 1
----------------------------------------------------------------
Subflow id: 1
Sending target: 931537 | weight: 1.000000
128->sent_bytes:0 (L:(nil),R:(nil)) subflows:1 
###############################################################
Seconds: 104
Active subflow num: 1
----------------------------------------------------------------
Subflow id: 1
Sending target: 802478 | weight: 1.000000
128->sent_bytes:0 (L:(nil),R:(nil)) subflows:1 
###############################################################
Seconds: 106
Active subflow num: 1
----------------------------------------------------------------
Subflow id: 1
Sending target: 802478 | weight: 1.000000
128->sent_bytes:0 (L:(nil),R:(nil)) subflows:1 
###############################################################
Seconds: 107
Active subflow num: 1
----------------------------------------------------------------
Subflow id: 1
Sending target: 802478 | weight: 1.000000
128->sent_bytes:0 (L:(nil),R:(nil)) subflows:1 
###############################################################
Seconds: 108
Active subflow num: 1
----------------------------------------------------------------
Subflow id: 1
Sending target: 870830 | weight: 1.000000
128->sent_bytes:0 (L:(nil),R:(nil)) subflows:1 
###############################################################
Seconds: 108
Active subflow num: 1
----------------------------------------------------------------
Subflow id: 1
Sending target: 721455 | weight: 1.000000
128->sent_bytes:0 (L:(nil),R:(nil)) subflows:1 
###############################################################
Seconds: 109
Active subflow num: 1
----------------------------------------------------------------
Subflow id: 1
Sending target: 721455 | weight: 1.000000
128->sent_bytes:0 (L:(nil),R:(nil)) subflows:1 
###############################################################
Seconds: 110
Active subflow num: 1
----------------------------------------------------------------
Subflow id: 1
Sending target: 721455 | weight: 1.000000
128->sent_bytes:0 (L:(nil),R:(nil)) subflows:1 
###############################################################
Seconds: 111
Active subflow num: 1
----------------------------------------------------------------
Subflow id: 1
Sending target: 778415 | weight: 1.000000
128->sent_bytes:0 (L:(nil),R:(nil)) subflows:1 
###############################################################
Seconds: 113
Active subflow num: 1
----------------------------------------------------------------
Subflow id: 1
Sending target: 808004 | weight: 1.000000
128->sent_bytes:0 (L:(nil),R:(nil)) subflows:1 
###############################################################
Seconds: 114
Active subflow num: 1
----------------------------------------------------------------
Subflow id: 1
Sending target: 864964 | weight: 1.000000
128->sent_bytes:0 (L:(nil),R:(nil)) subflows:1 
###############################################################
Seconds: 115
Active subflow num: 1
----------------------------------------------------------------
Subflow id: 1
Sending target: 928376 | weight: 1.000000
128->sent_bytes:0 (L:(nil),R:(nil)) subflows:1 
###############################################################
Seconds: 116
Active subflow num: 1
----------------------------------------------------------------
Subflow id: 1
Sending target: 928376 | weight: 1.000000
128->sent_bytes:0 (L:(nil),R:(nil)) subflows:1 
###############################################################
Seconds: 117
Active subflow num: 1
----------------------------------------------------------------
Subflow id: 1
Sending target: 783485 | weight: 1.000000
128->sent_bytes:0 (L:(nil),R:(nil)) subflows:1 
###############################################################
Seconds: 118
Active subflow num: 1
----------------------------------------------------------------
Subflow id: 1
Sending target: 783485 | weight: 1.000000
128->sent_bytes:0 (L:(nil),R:(nil)) subflows:1 
###############################################################
Seconds: 120
Active subflow num: 1
----------------------------------------------------------------
Subflow id: 1
Sending target: 783485 | weight: 1.000000
128->sent_bytes:0 (L:(nil),R:(nil)) subflows:1 
###############################################################
Seconds: 120
Active subflow num: 1
----------------------------------------------------------------
Subflow id: 1
Sending target: 840445 | weight: 1.000000
128->sent_bytes:0 (L:(nil),R:(nil)) subflows:1 
###############################################################
Seconds: 121
Active subflow num: 1
----------------------------------------------------------------
Subflow id: 1
Sending target: 840445 | weight: 1.000000
128->sent_bytes:0 (L:(nil),R:(nil)) subflows:1 
###############################################################
Seconds: 121
Active subflow num: 1
----------------------------------------------------------------
Subflow id: 1
Sending target: 907272 | weight: 1.000000
128->sent_bytes:0 (L:(nil),R:(nil)) subflows:1 
###############################################################
Seconds: 123
Active subflow num: 1
----------------------------------------------------------------
Subflow id: 1
Sending target: 975624 | weight: 1.000000
128->sent_bytes:0 (L:(nil),R:(nil)) subflows:1 
###############################################################
Seconds: 123
Active subflow num: 1
----------------------------------------------------------------
Subflow id: 1
Sending target: 810004 | weight: 1.000000
128->sent_bytes:0 (L:(nil),R:(nil)) subflows:1 
###############################################################
Seconds: 124
Active subflow num: 1
----------------------------------------------------------------
Subflow id: 1
Sending target: 810004 | weight: 1.000000
128->sent_bytes:0 (L:(nil),R:(nil)) subflows:1 
###############################################################
Seconds: 125
Active subflow num: 1
----------------------------------------------------------------
Subflow id: 1
Sending target: 810004 | weight: 1.000000
128->sent_bytes:0 (L:(nil),R:(nil)) subflows:1 
###############################################################
Seconds: 126
Active subflow num: 1
----------------------------------------------------------------
Subflow id: 1
Sending target: 810004 | weight: 1.000000
128->sent_bytes:0 (L:(nil),R:(nil)) subflows:1 
###############################################################
Seconds: 127
Active subflow num: 1
----------------------------------------------------------------
Subflow id: 1
Sending target: 866964 | weight: 1.000000
128->sent_bytes:0 (L:(nil),R:(nil)) subflows:1 
###############################################################
Seconds: 128
Active subflow num: 1
----------------------------------------------------------------
Subflow id: 1
Sending target: 932432 | weight: 1.000000
128->sent_bytes:0 (L:(nil),R:(nil)) subflows:1 
###############################################################
Seconds: 129
Active subflow num: 1
----------------------------------------------------------------
Subflow id: 1
Sending target: 932432 | weight: 1.000000
128->sent_bytes:0 (L:(nil),R:(nil)) subflows:1 
###############################################################
Seconds: 129
Active subflow num: 1
----------------------------------------------------------------
Subflow id: 1
Sending target: 793068 | weight: 1.000000
128->sent_bytes:0 (L:(nil),R:(nil)) subflows:1 
###############################################################
Seconds: 130
Active subflow num: 1
----------------------------------------------------------------
Subflow id: 1
Sending target: 785168 | weight: 1.000000
128->sent_bytes:0 (L:(nil),R:(nil)) subflows:1 
###############################################################
Seconds: 131
Active subflow num: 1
----------------------------------------------------------------
Subflow id: 1
Sending target: 783323 | weight: 1.000000
128->sent_bytes:0 (L:(nil),R:(nil)) subflows:1 
###############################################################
Seconds: 131
Active subflow num: 1
----------------------------------------------------------------
Subflow id: 1
Sending target: 783323 | weight: 1.000000
128->sent_bytes:0 (L:(nil),R:(nil)) subflows:1 
###############################################################
Seconds: 132
Active subflow num: 1
----------------------------------------------------------------
Subflow id: 1
Sending target: 783323 | weight: 1.000000
128->sent_bytes:0 (L:(nil),R:(nil)) subflows:1 
###############################################################
Seconds: 133
Active subflow num: 1
----------------------------------------------------------------
Subflow id: 1
Sending target: 840283 | weight: 1.000000
128->sent_bytes:0 (L:(nil),R:(nil)) subflows:1 
###############################################################
Seconds: 134
Active subflow num: 1
----------------------------------------------------------------
Subflow id: 1
Sending target: 840283 | weight: 1.000000
128->sent_bytes:0 (L:(nil),R:(nil)) subflows:1 
###############################################################
Seconds: 135
Active subflow num: 1
----------------------------------------------------------------
Subflow id: 1
Sending target: 900328 | weight: 1.000000
128->sent_bytes:0 (L:(nil),R:(nil)) subflows:1 
###############################################################
Seconds: 136
Active subflow num: 1
----------------------------------------------------------------
Subflow id: 1
Sending target: 900328 | weight: 1.000000
128->sent_bytes:0 (L:(nil),R:(nil)) subflows:1 
###############################################################
Seconds: 136
Active subflow num: 1
----------------------------------------------------------------
Subflow id: 1
Sending target: 980072 | weight: 1.000000
128->sent_bytes:0 (L:(nil),R:(nil)) subflows:1 
###############################################################
Seconds: 137
Active subflow num: 1
----------------------------------------------------------------
Subflow id: 1
Sending target: 793532 | weight: 1.000000
128->sent_bytes:0 (L:(nil),R:(nil)) subflows:1 
###############################################################
Seconds: 138
Active subflow num: 1
----------------------------------------------------------------
Subflow id: 1
Sending target: 793516 | weight: 1.000000
128->sent_bytes:0 (L:(nil),R:(nil)) subflows:1 
###############################################################
Seconds: 140
Active subflow num: 1
----------------------------------------------------------------
Subflow id: 1
Sending target: 793490 | weight: 1.000000
128->sent_bytes:0 (L:(nil),R:(nil)) subflows:1 
###############################################################
Seconds: 140
Active subflow num: 1
----------------------------------------------------------------
Subflow id: 1
Sending target: 793490 | weight: 1.000000
128->sent_bytes:0 (L:(nil),R:(nil)) subflows:1 
###############################################################
Seconds: 141
Active subflow num: 1
----------------------------------------------------------------
Subflow id: 1
Sending target: 793490 | weight: 1.000000
128->sent_bytes:0 (L:(nil),R:(nil)) subflows:1 
###############################################################
Seconds: 142
Active subflow num: 1
----------------------------------------------------------------
Subflow id: 1
Sending target: 850450 | weight: 1.000000
128->sent_bytes:0 (L:(nil),R:(nil)) subflows:1 
###############################################################
Seconds: 143
Active subflow num: 1
----------------------------------------------------------------
Subflow id: 1
Sending target: 850450 | weight: 1.000000
128->sent_bytes:0 (L:(nil),R:(nil)) subflows:1 
###############################################################
Seconds: 143
Active subflow num: 1
----------------------------------------------------------------
Subflow id: 1
Sending target: 902272 | weight: 1.000000
128->sent_bytes:0 (L:(nil),R:(nil)) subflows:1 
###############################################################
Seconds: 144
Active subflow num: 1
----------------------------------------------------------------
Subflow id: 1
Sending target: 902272 | weight: 1.000000
128->sent_bytes:0 (L:(nil),R:(nil)) subflows:1 
###############################################################
Seconds: 144
Active subflow num: 1
----------------------------------------------------------------
Subflow id: 1
Sending target: 763830 | weight: 1.000000
128->sent_bytes:0 (L:(nil),R:(nil)) subflows:1 
###############################################################
Seconds: 145
Active subflow num: 1
----------------------------------------------------------------
Subflow id: 1
Sending target: 763830 | weight: 1.000000
128->sent_bytes:0 (L:(nil),R:(nil)) subflows:1 
###############################################################
Seconds: 146
Active subflow num: 1
----------------------------------------------------------------
Subflow id: 1
Sending target: 763830 | weight: 1.000000
128->sent_bytes:0 (L:(nil),R:(nil)) subflows:1 
###############################################################
Seconds: 147
Active subflow num: 1
----------------------------------------------------------------
Subflow id: 1
Sending target: 763830 | weight: 1.000000
128->sent_bytes:0 (L:(nil),R:(nil)) subflows:1 
###############################################################
Seconds: 147
Active subflow num: 1
----------------------------------------------------------------
Subflow id: 1
Sending target: 820790 | weight: 1.000000
128->sent_bytes:0 (L:(nil),R:(nil)) subflows:1 
###############################################################
Seconds: 148
Active subflow num: 1
----------------------------------------------------------------
Subflow id: 1
Sending target: 820790 | weight: 1.000000
128->sent_bytes:0 (L:(nil),R:(nil)) subflows:1 
###############################################################
Seconds: 149
Active subflow num: 1
----------------------------------------------------------------
Subflow id: 1
Sending target: 879128 | weight: 1.000000
128->sent_bytes:0 (L:(nil),R:(nil)) subflows:1 
