{
    "unicast" : "192.168.1.3",
    "logging" :
    {
        "level" : "debug",
        "console" : "true",
        "file" : { "enable" : "false", "path" : "/tmp/vsomeip.log" },
        "dlt" : "false"
    },
    "npdu-default-timings" : {
        "debounce-time-request" : "0",
        "debounce-time-response" : "0",
        "max-retention-time-request" : "0",
        "max-retention-time-response" : "0"
    },
    "applications" :
    [
        {
            "name" : "routing_manager",
            "id" : "0x0101"
        },
        {
            "name" : "bluetooth_hci_client",
            "id" : "0x2468"
        },
        {
            "name" : "bluetooth_handsfree_audio_client",
            "id" : "0x2478"
        },
        {
            "name": "wifi_hal_client",
            "id":"0x1101"
        },
        {
            "name": "wifi_cem_hal_client",
            "id":"0x1102"
        },
        {
            "name": "nlinterceptor_client",
            "id":"0x1201"
        },
        {
            "name": "supplicant_someip_client",
            "id":"0x1301"
        },
        {
            "name": "hostapd_someip_client",
            "id":"0x1401"
        },
        {
            "name": "hostapd_cem_someip_client",
            "id":"0x1402"
        },
        {
            "name": "qtiwifi_someip_client",
            "id":"0x1501"
        },
        {
            "name": "qtiwifi_cem_someip_client",
            "id":"0x1502"
        }
    ],
    "services" :
    [
        {
            "service" : "0x7800",
            "instance" : "0x06A3",
            "events" :
            [
                {
                    "event" : "0x8000",
                    "is_field" : "true",
                    "is_reliable" : "true"
                },
                {
                    "event" : "0x8001",
                    "is_field" : "true",
                    "is_reliable" : "true"
                },
                {
                    "event" : "0x8002",
                    "is_field" : "true",
                    "is_reliable" : "true"
                },
                {
                    "event" : "0x8003",
                    "is_field" : "true",
                    "is_reliable" : "true"
                },
                {
                    "event" : "0x8004",
                    "is_field" : "true",
                    "is_reliable" : "true"
                }
            ]
        },
        {
            "service" : "0x7901",
            "instance" : "0x1110",
            "events" :
            [
                {
                    "event" : "0x8103",
                    "is_field" : "true",
                    "is_reliable" : "true"
                },
                {
                    "event" : "0x8006",
                    "is_field" : "true",
                    "is_reliable" : "true"
                },
                {
                    "event" : "0x8400",
                    "is_field" : "true",
                    "is_reliable" : "true"
                },
                {
                    "event" : "0x8401",
                    "is_field" : "true",
                    "is_reliable" : "true"
                },
                {
                    "event" : "0x8402",
                    "is_field" : "true",
                    "is_reliable" : "true"
                },
                {
                    "event" : "0x8403",
                    "is_field" : "true",
                    "is_reliable" : "true"
                }
            ]
        },
        {
            "service" : "0x7901",
            "instance" : "0x1111",
            "events" :
            [
                {
                    "event" : "0x8103",
                    "is_field" : "true",
                    "is_reliable" : "true"
                },
                {
                    "event" : "0x8006",
                    "is_field" : "true",
                    "is_reliable" : "true"
                },
                {
                    "event" : "0x8400",
                    "is_field" : "true",
                    "is_reliable" : "true"
                },
                {
                    "event" : "0x8401",
                    "is_field" : "true",
                    "is_reliable" : "true"
                },
                {
                    "event" : "0x8402",
                    "is_field" : "true",
                    "is_reliable" : "true"
                },
                {
                    "event" : "0x8403",
                    "is_field" : "true",
                    "is_reliable" : "true"
                }
            ]
        },
        {
            "service" : "0x7902",
            "instance" : "0x2220",
            "events" :
            [
                {
                    "event" : "0x8000",
                    "is_field" : "true",
                    "is_reliable" : "true"
                },
                {
                    "event" : "0x8001",
                    "is_field" : "true",
                    "is_reliable" : "true"
                }
            ]
        },
        {
            "service" : "0x7903",
            "instance" : "0x3330",
            "events" :
            [
                {
                    "event" : "0x8000",
                    "is_field" : "true",
                    "is_reliable" : "true"
                },
                {
                    "event" : "0x8001",
                    "is_field" : "true",
                    "is_reliable" : "true"
                },
                {
                    "event" : "0x8200",
                    "is_field" : "true",
                    "is_reliable" : "true"
                },
                {
                    "event" : "0x8201",
                    "is_field" : "true",
                    "is_reliable" : "true"
                },
                {
                    "event" : "0x8202",
                    "is_field" : "true",
                    "is_reliable" : "true"
                },
                {
                    "event" : "0x8203",
                    "is_field" : "true",
                    "is_reliable" : "true"
                },
                {
                    "event" : "0x8204",
                    "is_field" : "true",
                    "is_reliable" : "true"
                },
                {
                    "event" : "0x8205",
                    "is_field" : "true",
                    "is_reliable" : "true"
                },
                {
                    "event" : "0x8206",
                    "is_field" : "true",
                    "is_reliable" : "true"
                },
                {
                    "event" : "0x8207",
                    "is_field" : "true",
                    "is_reliable" : "true"
                },
                {
                    "event" : "0x8208",
                    "is_field" : "true",
                    "is_reliable" : "true"
                },
                {
                    "event" : "0x8209",
                    "is_field" : "true",
                    "is_reliable" : "true"
                },
                {
                    "event" : "0x820A",
                    "is_field" : "true",
                    "is_reliable" : "true"
                },
                {
                    "event" : "0x820B",
                    "is_field" : "true",
                    "is_reliable" : "true"
                },
                {
                    "event" : "0x820C",
                    "is_field" : "true",
                    "is_reliable" : "true"
                },
                {
                    "event" : "0x820D",
                    "is_field" : "true",
                    "is_reliable" : "true"
                },
                {
                    "event" : "0x820E",
                    "is_field" : "true",
                    "is_reliable" : "true"
                },
                {
                    "event" : "0x820F",
                    "is_field" : "true",
                    "is_reliable" : "true"
                },
                {
                    "event" : "0x8210",
                    "is_field" : "true",
                    "is_reliable" : "true"
                },
                {
                    "event" : "0x8211",
                    "is_field" : "true",
                    "is_reliable" : "true"
                },
                {
                    "event" : "0x8212",
                    "is_field" : "true",
                    "is_reliable" : "true"
                },
                {
                    "event" : "0x8213",
                    "is_field" : "true",
                    "is_reliable" : "true"
                },
                {
                    "event" : "0x8214",
                    "is_field" : "true",
                    "is_reliable" : "true"
                },
                {
                    "event" : "0x8215",
                    "is_field" : "true",
                    "is_reliable" : "true"
                },
                {
                    "event" : "0x8216",
                    "is_field" : "true",
                    "is_reliable" : "true"
                },
                {
                    "event" : "0x8217",
                    "is_field" : "true",
                    "is_reliable" : "true"
                },
                {
                    "event" : "0x8218",
                    "is_field" : "true",
                    "is_reliable" : "true"
                },
                {
                    "event" : "0x8219",
                    "is_field" : "true",
                    "is_reliable" : "true"
                },
                {
                    "event" : "0x821A",
                    "is_field" : "true",
                    "is_reliable" : "true"
                },
                {
                    "event" : "0x821B",
                    "is_field" : "true",
                    "is_reliable" : "true"
                },
                {
                    "event" : "0x821C",
                    "is_field" : "true",
                    "is_reliable" : "true"
                },
                {
                    "event" : "0x821D",
                    "is_field" : "true",
                    "is_reliable" : "true"
                },
                {
                    "event" : "0x821E",
                    "is_field" : "true",
                    "is_reliable" : "true"
                },
                {
                    "event" : "0x821F",
                    "is_field" : "true",
                    "is_reliable" : "true"
                },
                {
                    "event" : "0x8220",
                    "is_field" : "true",
                    "is_reliable" : "true"
                },
                {
                    "event" : "0x8221",
                    "is_field" : "true",
                    "is_reliable" : "true"
                },
                {
                    "event" : "0x8222",
                    "is_field" : "true",
                    "is_reliable" : "true"
                },
                {
                    "event" : "0x8223",
                    "is_field" : "true",
                    "is_reliable" : "true"
                },
                {
                    "event" : "0x8300",
                    "is_field" : "true",
                    "is_reliable" : "true"
                },
                {
                    "event" : "0x8301",
                    "is_field" : "true",
                    "is_reliable" : "true"
                },
                {
                    "event" : "0x8302",
                    "is_field" : "true",
                    "is_reliable" : "true"
                },
                {
                    "event" : "0x8303",
                    "is_field" : "true",
                    "is_reliable" : "true"
                },
                {
                    "event" : "0x8304",
                    "is_field" : "true",
                    "is_reliable" : "true"
                },
                {
                    "event" : "0x8305",
                    "is_field" : "true",
                    "is_reliable" : "true"
                },
                {
                    "event" : "0x9000",
                    "is_field" : "true",
                    "is_reliable" : "true"
                }
            ]
        },
        {
            "service" : "0x7904",
            "instance" : "0x4440",
            "events" :
            [
                {
                    "event" : "0x8000",
                    "is_field" : "true",
                    "is_reliable" : "true"
                },
                {
                    "event" : "0x8001",
                    "is_field" : "true",
                    "is_reliable" : "true"
                },
                {
                    "event" : "0x8002",
                    "is_field" : "true",
                    "is_reliable" : "true"
                }
            ]
        },
        {
            "service" : "0x7904",
            "instance" : "0x4441",
            "events" :
            [
                {
                    "event" : "0x8000",
                    "is_field" : "true",
                    "is_reliable" : "true"
                },
                {
                    "event" : "0x8001",
                    "is_field" : "true",
                    "is_reliable" : "true"
                },
                {
                    "event" : "0x8002",
                    "is_field" : "true",
                    "is_reliable" : "true"
                }
            ]
        },
        {
            "service" : "0x7905",
            "instance" : "0x5550",
            "events" :
            [
                {
                    "event" : "0x8000",
                    "is_field" : "true",
                    "is_reliable" : "true"
                }
            ]
        },
        {
            "service" : "0x7905",
            "instance" : "0x5551",
            "events" :
            [
                {
                    "event" : "0x8000",
                    "is_field" : "true",
                    "is_reliable" : "true"
                }
            ]
        }
    ],
    "routing" : "routing_manager",
    "service-discovery" :
    {
        "enable" : "true",
        "multicast" : "224.244.224.245",
        "port" : "30500",
        "protocol" : "udp",
        "initial_delay_min" : "10",
        "initial_delay_max" : "100",
        "repetitions_base_delay" : "200",
        "repetitions_max" : "3",
        "ttl" : "3600",
        "cyclic_offer_delay" : "2000",
        "request_response_delay" : "1500"
    }
}
