# tracer: nop
#
# entries-in-buffer/entries-written: 642747/642747   #P:8
#
#                              _-----=> irqs-off
#                             / _----=> need-resched
#                            | / _---=> hardirq/softirq
#                            || / _--=> preempt-depth
#                            ||| /     delay
#           TASK-PID   CPU#  ||||    TIMESTAMP  FUNCTION
#              | |       |   ||||       |         |
          <idle>-0     [006] d.h2  1317.316750: sched_boost_task: comm=droid.apps.docs pid=4501 util=36 margin=98
          <idle>-0     [006] d.h2  1317.316760: sched_cpu_util: cpu=4 nr_running=0 cpu_util=0 cpu_util_cum=0 capacity_curr=301 capacity=1024 capacity_orig=1024 idle_state=2 irqload=0
          <idle>-0     [006] d.h2  1317.316763: sched_task_util: pid=4501 comm=droid.apps.docs util=36 prev_cpu=6 next_cpu=4 backup_cpu=-1 target_cpu=4 need_idle=0 fastpath=0 placement_boost=0 rtg_cpu=-1 latency=18489
  kworker/u16:18-2878  [003] ....  1317.316776: memlat_dev_meas: dev: soc:qcom,memlat-cpu0, id=0, inst=89588, mem=762, freq=36, stall=100, ratio=117
          <idle>-0     [006] d.h3  1317.316778: sched_enq_deq_task: cpu=4 enqueue comm=droid.apps.docs pid=4501 prio=110 nr_running=1 cpu_load=0 rt_nr_running=0 affine=ff demand=708433 pred_demand=678357
  kworker/u16:18-2878  [003] ....  1317.316781: memlat_dev_meas: dev: soc:qcom,memlat-cpu0, id=1, inst=461054, mem=41187, freq=280, stall=100, ratio=11
          <idle>-0     [006] d.h3  1317.316783: sched_wakeup: comm=droid.apps.docs pid=4501 prio=110 target_cpu=004
  kworker/u16:18-2878  [003] ....  1317.316783: memlat_dev_meas: dev: soc:qcom,memlat-cpu0, id=2, inst=445876, mem=37752, freq=368, stall=100, ratio=11
  kworker/u16:18-2878  [003] ....  1317.316785: memlat_dev_meas: dev: soc:qcom,memlat-cpu0, id=3, inst=321411, mem=1886, freq=110, stall=100, ratio=170
          <idle>-0     [006] d.h1  1317.316786: irq_handler_exit: irq=6 ret=handled
  kworker/u16:18-2878  [003] ....  1317.316788: memlat_dev_update: dev: soc:qcom,memlat-cpu0, id=2, inst=445876, mem=37752, freq=368, vote=1720
          <idle>-0     [006] ...1  1317.316795: cpu_idle: state=4294967295 cpu_id=6
          <idle>-0     [006] d..1  1317.316807: cpu_power_select: idx:2 sleep_time:69634 latency:30000 next_event:0
          <idle>-0     [006] d..1  1317.316808: cpu_pred_select: pred:0 time:0 tmr_time:0
          <idle>-0     [006] d..1  1317.316809: cpu_idle: state=2 cpu_id=6
  kworker/u16:18-2878  [003] d..2  1317.316810: sched_enq_deq_task: cpu=3 dequeue comm=kworker/u16:18 pid=2878 prio=120 nr_running=0 cpu_load=0 rt_nr_running=0 affine=ff demand=128212 pred_demand=70772
          <idle>-0     [006] d..1  1317.316816: cpu_idle_enter: idx:2
  kworker/u16:16-1258  [002] d..2  1317.316827: sched_boost_task: comm=VideoDecCallBac pid=4806 util=11 margin=0
  kworker/u16:18-2878  [003] d..2  1317.316833: sched_switch: prev_comm=kworker/u16:18 prev_pid=2878 prev_prio=120 prev_state=S ==> next_comm=swapper/3 next_pid=0 next_prio=120
  kworker/u16:16-1258  [002] d..2  1317.316833: sched_boost_task: comm=VideoDecCallBac pid=4806 util=11 margin=0
  kworker/u16:16-1258  [002] d..2  1317.316835: sched_cpu_util: cpu=0 nr_running=0 cpu_util=0 cpu_util_cum=35 capacity_curr=140 capacity=368 capacity_orig=381 idle_state=0 irqload=482854
  kworker/u16:16-1258  [002] d..2  1317.316839: sched_task_util: pid=4806 comm=VideoDecCallBac util=11 prev_cpu=1 next_cpu=0 backup_cpu=-1 target_cpu=0 need_idle=0 fastpath=0 placement_boost=0 rtg_cpu=-1 latency=16041
          <idle>-0     [003] d..1  1317.316845: cpu_power_select: idx:0 sleep_time:968 latency:30000 next_event:0
          <idle>-0     [003] d..1  1317.316847: cpu_pred_select: pred:0 time:0 tmr_time:0
          <idle>-0     [003] d..1  1317.316848: cpu_idle: state=0 cpu_id=3
  kworker/u16:16-1258  [002] d..3  1317.316850: sched_boost_task: comm=VideoDecCallBac pid=4806 util=11 margin=0
          <idle>-0     [003] d..1  1317.316851: cpu_idle_enter: idx:0
  kworker/u16:16-1258  [002] d..3  1317.316857: sched_enq_deq_task: cpu=0 enqueue comm=VideoDecCallBac pid=4806 prio=118 nr_running=1 cpu_load=2 rt_nr_running=0 affine=cf demand=221503 pred_demand=221503
  kworker/u16:16-1258  [002] d..3  1317.316865: sched_wakeup: comm=VideoDecCallBac pid=4806 prio=118 target_cpu=000
          <idle>-0     [000] dn.1  1317.316867: cpu_pred_hist: idx:0 resi:4649 sample:3 tmr:1
          <idle>-0     [000] dn.1  1317.316871: cpu_idle_exit: idx:0 success:1
          <idle>-0     [000] .n.1  1317.316877: cpu_idle: state=4294967295 cpu_id=0
          <idle>-0     [000] dn.2  1317.316890: sched_boost_task: comm=VideoDecCallBac pid=4806 util=11 margin=0
          <idle>-0     [000] d..2  1317.316897: sched_switch: prev_comm=swapper/0 prev_pid=0 prev_prio=120 prev_state=R ==> next_comm=VideoDecCallBac next_pid=4806 next_prio=118
  kworker/u16:16-1258  [002] d..2  1317.316948: sched_enq_deq_task: cpu=2 dequeue comm=kworker/u16:16 pid=1258 prio=120 nr_running=0 cpu_load=80 rt_nr_running=0 affine=ff demand=1154091 pred_demand=1154091
  kworker/u16:16-1258  [002] d..2  1317.316978: sched_switch: prev_comm=kworker/u16:16 prev_pid=1258 prev_prio=120 prev_state=S ==> next_comm=swapper/2 next_pid=0 next_prio=120
          <idle>-0     [002] d..1  1317.316994: cpu_power_select: idx:0 sleep_time:2775 latency:30000 next_event:0
          <idle>-0     [002] d..1  1317.316996: cpu_pred_select: pred:0 time:0 tmr_time:0
          <idle>-0     [002] d..1  1317.316998: cpu_idle: state=0 cpu_id=2
          <idle>-0     [002] d..1  1317.317001: cpu_idle_enter: idx:0
 VideoDecCallBac-4806  [000] d..1  1317.317077: sched_boost_task: comm=VideoDecMsgThre pid=4808 util=32 margin=0
 VideoDecCallBac-4806  [000] d..1  1317.317080: sched_boost_task: comm=VideoDecMsgThre pid=4808 util=32 margin=0
 VideoDecCallBac-4806  [000] d..1  1317.317083: sched_cpu_util: cpu=0 nr_running=1 cpu_util=11 cpu_util_cum=46 capacity_curr=140 capacity=368 capacity_orig=381 idle_state=-1 irqload=482854
 VideoDecCallBac-4806  [000] d..1  1317.317086: sched_cpu_util: cpu=1 nr_running=1 cpu_util=123 cpu_util_cum=195 capacity_curr=140 capacity=368 capacity_orig=381 idle_state=-1 irqload=721860
 VideoDecCallBac-4806  [000] d..1  1317.317088: sched_cpu_util: cpu=2 nr_running=0 cpu_util=0 cpu_util_cum=66 capacity_curr=140 capacity=368 capacity_orig=381 idle_state=0 irqload=435644
 VideoDecCallBac-4806  [000] d..1  1317.317092: sched_task_util: pid=4808 comm=VideoDecMsgThre util=32 prev_cpu=0 next_cpu=2 backup_cpu=-1 target_cpu=2 need_idle=0 fastpath=0 placement_boost=0 rtg_cpu=-1 latency=18854
 VideoDecCallBac-4806  [000] d..2  1317.317104: sched_boost_task: comm=VideoDecMsgThre pid=4808 util=32 margin=0
 VideoDecCallBac-4806  [000] d..2  1317.317113: sched_enq_deq_task: cpu=2 enqueue comm=VideoDecMsgThre pid=4808 prio=118 nr_running=1 cpu_load=80 rt_nr_running=0 affine=cf demand=628582 pred_demand=604300
 VideoDecCallBac-4806  [000] d..2  1317.317120: sched_wakeup: comm=VideoDecMsgThre pid=4808 prio=118 target_cpu=002
          <idle>-0     [002] dn.1  1317.317122: cpu_pred_hist: idx:0 resi:121 sample:4 tmr:0
          <idle>-0     [002] dn.1  1317.317124: cpu_idle_exit: idx:0 success:1
          <idle>-0     [002] .n.1  1317.317129: cpu_idle: state=4294967295 cpu_id=2
          <idle>-0     [002] dn.2  1317.317137: sched_boost_task: comm=VideoDecMsgThre pid=4808 util=32 margin=0
          <idle>-0     [002] d..2  1317.317144: sched_switch: prev_comm=swapper/2 prev_pid=0 prev_prio=120 prev_state=R ==> next_comm=VideoDecMsgThre next_pid=4808 next_prio=118
          <idle>-0     [004] dn.1  1317.317155: cpu_pred_hist: idx:2 resi:12803 sample:2 tmr:0
          <idle>-0     [004] dn.1  1317.317158: cpu_idle_exit: idx:2 success:1
          <idle>-0     [004] .n.1  1317.317164: cpu_idle: state=4294967295 cpu_id=4
          <idle>-0     [004] d..2  1317.317183: sched_switch: prev_comm=swapper/4 prev_pid=0 prev_prio=120 prev_state=R ==> next_comm=droid.apps.docs next_pid=4501 next_prio=110
 VideoDecMsgThre-4808  [002] d..1  1317.317230: sched_boost_task: comm=OMXCallbackDisp pid=4809 util=10 margin=0
 VideoDecMsgThre-4808  [002] d..1  1317.317234: sched_boost_task: comm=OMXCallbackDisp pid=4809 util=10 margin=0
 VideoDecMsgThre-4808  [002] d..1  1317.317236: sched_cpu_util: cpu=0 nr_running=1 cpu_util=11 cpu_util_cum=14 capacity_curr=140 capacity=368 capacity_orig=381 idle_state=-1 irqload=482854
 VideoDecMsgThre-4808  [002] d..1  1317.317239: sched_cpu_util: cpu=1 nr_running=1 cpu_util=123 cpu_util_cum=195 capacity_curr=140 capacity=368 capacity_orig=381 idle_state=-1 irqload=721860
 VideoDecMsgThre-4808  [002] d..1  1317.317241: sched_cpu_util: cpu=2 nr_running=1 cpu_util=32 cpu_util_cum=98 capacity_curr=140 capacity=368 capacity_orig=381 idle_state=-1 irqload=435644
 VideoDecMsgThre-4808  [002] d..1  1317.317243: sched_cpu_util: cpu=3 nr_running=0 cpu_util=0 cpu_util_cum=42 capacity_curr=140 capacity=370 capacity_orig=381 idle_state=0 irqload=324619
 VideoDecMsgThre-4808  [002] d..1  1317.317247: sched_task_util: pid=4809 comm=OMXCallbackDisp util=10 prev_cpu=1 next_cpu=3 backup_cpu=-1 target_cpu=3 need_idle=0 fastpath=0 placement_boost=0 rtg_cpu=-1 latency=19427
 VideoDecMsgThre-4808  [002] d..2  1317.317259: sched_boost_task: comm=OMXCallbackDisp pid=4809 util=10 margin=0
 VideoDecMsgThre-4808  [002] d..2  1317.317267: sched_enq_deq_task: cpu=3 enqueue comm=OMXCallbackDisp pid=4809 prio=118 nr_running=1 cpu_load=0 rt_nr_running=0 affine=cf demand=199562 pred_demand=199562
 VideoDecMsgThre-4808  [002] d..2  1317.317274: sched_wakeup: comm=OMXCallbackDisp pid=4809 prio=118 target_cpu=003
          <idle>-0     [003] dn.1  1317.317275: cpu_pred_hist: idx:0 resi:423 sample:4 tmr:0
          <idle>-0     [003] dn.1  1317.317277: cpu_idle_exit: idx:0 success:1
          <idle>-0     [003] .n.1  1317.317282: cpu_idle: state=4294967295 cpu_id=3
          <idle>-0     [003] dn.2  1317.317291: sched_boost_task: comm=OMXCallbackDisp pid=4809 util=10 margin=0
          <idle>-0     [003] d..2  1317.317299: sched_switch: prev_comm=swapper/3 prev_pid=0 prev_prio=120 prev_state=R ==> next_comm=OMXCallbackDisp next_pid=4809 next_prio=118
 VideoDecMsgThre-4808  [002] d..2  1317.317308: sched_enq_deq_task: cpu=2 dequeue comm=VideoDecMsgThre pid=4808 prio=118 nr_running=0 cpu_load=80 rt_nr_running=0 affine=cf demand=628582 pred_demand=604300
 VideoDecMsgThre-4808  [002] d..2  1317.317332: sched_switch: prev_comm=VideoDecMsgThre prev_pid=4808 prev_prio=118 prev_state=S ==> next_comm=swapper/2 next_pid=0 next_prio=120
          <idle>-0     [002] d..1  1317.317345: cpu_power_select: idx:0 sleep_time:2422 latency:30000 next_event:0
          <idle>-0     [002] d..1  1317.317347: cpu_pred_select: pred:0 time:0 tmr_time:0
          <idle>-0     [002] d..1  1317.317349: cpu_idle: state=0 cpu_id=2
          <idle>-0     [002] d..1  1317.317352: cpu_idle_enter: idx:0
 droid.apps.docs-4501  [004] d..4  1317.317361: sched_boost_task: comm=Binder:868_3 pid=1525 util=16 margin=0
 droid.apps.docs-4501  [004] d..4  1317.317364: sched_cpu_util: cpu=6 nr_running=0 cpu_util=0 cpu_util_cum=23 capacity_curr=301 capacity=1022 capacity_orig=1024 idle_state=2 irqload=254248
 droid.apps.docs-4501  [004] d..4  1317.317366: sched_task_util: pid=1525 comm=Binder:868_3 util=16 prev_cpu=6 next_cpu=6 backup_cpu=-1 target_cpu=6 need_idle=0 fastpath=0 placement_boost=0 rtg_cpu=-1 latency=8177
 droid.apps.docs-4501  [004] d..5  1317.317373: sched_enq_deq_task: cpu=6 enqueue comm=Binder:868_3 pid=1525 prio=110 nr_running=1 cpu_load=0 rt_nr_running=0 affine=cf demand=322643 pred_demand=185542
 droid.apps.docs-4501  [004] d..5  1317.317377: sched_wakeup: comm=Binder:868_3 pid=1525 prio=110 target_cpu=006
 droid.apps.docs-4501  [004] d..2  1317.317400: sched_enq_deq_task: cpu=4 dequeue comm=droid.apps.docs pid=4501 prio=110 nr_running=0 cpu_load=0 rt_nr_running=0 affine=ff demand=708433 pred_demand=678357
 droid.apps.docs-4501  [004] d..2  1317.317416: sched_switch: prev_comm=droid.apps.docs prev_pid=4501 prev_prio=110 prev_state=S ==> next_comm=swapper/4 next_pid=0 next_prio=120
          <idle>-0     [004] d..1  1317.317431: cpu_power_select: idx:2 sleep_time:1069775 latency:30000 next_event:0
          <idle>-0     [004] d..1  1317.317432: cpu_pred_select: pred:1 time:12964 tmr_time:0
          <idle>-0     [004] d..1  1317.317433: cpu_idle: state=2 cpu_id=4
