signature
|Lcom/android/healthfitness/flags/CustomFeatureFlags;->dependencyInjection()Z|
|Lcom/android/healthfitness/flags/CustomFeatureFlags;->exportImport()Z|
|Lcom/android/healthfitness/flags/CustomFeatureFlags;->mindfulness()Z|
|Lcom/android/healthfitness/flags/CustomFeatureFlags;->personalHealthRecord()Z|
|Lcom/android/healthfitness/flags/CustomFeatureFlags;->personalHealthRecordDatabase()Z|
|Lcom/android/healthfitness/flags/FeatureFlags;->dependencyInjection()Z|
|Lcom/android/healthfitness/flags/FeatureFlags;->exportImport()Z|
|Lcom/android/healthfitness/flags/FeatureFlags;->mindfulness()Z|
|Lcom/android/healthfitness/flags/FeatureFlags;->personalHealthRecord()Z|
|Lcom/android/healthfitness/flags/FeatureFlags;->personalHealthRecordDatabase()Z|
|Lcom/android/healthfitness/flags/FeatureFlagsImpl;->dependencyInjection()Z|
|Lcom/android/healthfitness/flags/FeatureFlagsImpl;->exportImport()Z|
|Lcom/android/healthfitness/flags/FeatureFlagsImpl;->mindfulness()Z|
|Lcom/android/healthfitness/flags/FeatureFlagsImpl;->personalHealthRecord()Z|
|Lcom/android/healthfitness/flags/FeatureFlagsImpl;->personalHealthRecordDatabase()Z|
|Lcom/android/healthfitness/flags/Flags;->dependencyInjection()Z|
|Lcom/android/healthfitness/flags/Flags;->exportImport()Z|
|Lcom/android/healthfitness/flags/Flags;->mindfulness()Z|
|Lcom/android/healthfitness/flags/Flags;->personalHealthRecord()Z|
|Lcom/android/healthfitness/flags/Flags;->personalHealthRecordDatabase()Z|
