0
160000
80000
40000
120000
200000
520000
360000
240000
280000
320000
400000
440000
480000
840000
680000
560000
600000
640000
720000
760000
800000
1160000
1000000
880000
920000
960000
1040000
1080000
1120000
1480000
1320000
1200000
1240000
1280000
1360000
1400000
1440000
1800000
1640000
1520000
1560000
1600000
1680000
1720000
1760000
2120000
1960000
1840000
1880000
1920000
2000000
2040000
2080000
2440000
2280000
2160000
2200000
2240000
2320000
2360000
2400000
2760000
2600000
2480000
2520000
2560000
2640000
2680000
2720000
3080000
2920000
2800000
2840000
2880000
2960000
3000000
3040000
3400000
3240000
3120000
3160000
3200000
3280000
3320000
3360000
3720000
3560000
3440000
3480000
3520000
3600000
3640000
3680000
4040000
3880000
3760000
3800000
3840000
3920000
3960000
4000000
4360000
4200000
4080000
4120000
4160000
4240000
4280000
4320000
4680000
4520000
4400000
4440000
4480000
4560000
4600000
4640000
4960000
4840000
4720000
4760000
4800000
4880000
4920000

