66666
166666
100000
133333
300000
233333
200000
266666
433333
366666
333333
400000
566666
500000
466666
533333
666666
600000
633333
800000
733333
700000
766666
900000
833333
866666
1033333
966666
933333
1000000
1066666
1166666
1100000
1133333
1300000
1233333
1200000
1266666
1433333
1366666
1333333
1400000
1566666
1500000
1466666
1533333
1666666
1600000
1633333
1800000
1733333
1700000
1766666
1900000
1833333
1866666
2000000
1933333
1966666
2033333
2066666
2166666
2100000
2133333
2300000
2233333
2200000
2266666
2433333
2366666
2333333
2400000
2566666
2500000
2466666
2533333
2700000
2633333
2600000
2666666
2833333
2766666
2733333
2800000
2966666
2900000
2866666
2933333
3033333
3000000
3066666
3166666
3100000
3133333
3300000
3233333
3200000
3266666
3433333
3366666
3333333
3400000
3566666
3500000
3466666
3533333
3666666
3600000
3633333
3800000
3733333
3700000
3766666
3900000
3833333
3866666
4000000
3933333
3966666
4033333
4066666
4166666
4100000
4133333
4300000
4233333
4200000
4266666
4433333
4366666
4333333
4400000
4566666
4500000
4466666
4533333
4666666
4600000
4633333
4733333
4700000
4833333
4766666
4800000
4966666
4900000
4866666
4933333
5033333
5000000
5066666
5166666
5100000
5133333
5300000
5233333
5200000
5266666
5433333
5366666
5333333
5400000
5566666
5500000
5466666
5533333
5666666
5600000
5633333
5800000
5733333
5700000
5766666
5900000
5833333
5866666
6033333
5966666
5933333
6000000
6066666
6166666
6100000
6133333
6300000
6233333
6200000
6266666
6433333
6366666
6333333
6400000
6566666
6500000
6466666
6533333
6666666
6600000
6633333
6800000
6733333
6700000
6766666
6900000
6833333
6866666
7000000
6933333
6966666
7033333
7066666
7166666
7100000
7133333
7300000
7233333
7200000
7266666
7433333
7366666
7333333
7400000
7566666
7500000
7466666
7533333
7700000
7633333
7600000
7666666
7833333
7766666
7733333
7800000
7966666
7900000
7866666
7933333
8033333
8000000
8066666
8166666
8100000
8133333
8300000
8233333
8200000
8266666
8433333
8366666
8333333
8400000
8566666
8500000
8466666
8533333
8666666
8600000
8633333
8800000
8733333
8700000
8766666
8900000
8833333
8866666
9000000
8933333
8966666
9033333
9066666
9166666
9100000
9133333
9300000
9233333
9200000
9266666
9366666
9333333
9500000
9433333
9400000
9466666
9633333
9566666
9533333
9600000
9766666
9700000
9666666
9733333
9900000
9833333
9800000
9866666
10000000
9933333
9966666
10033333
10066666
10166666
10100000
10133333
10300000
10233333
10200000
10266666
10433333
10366666
10333333
10400000
10566666
10500000
10466666
10533333
10666666
10600000
10633333
10800000
10733333
10700000
10766666
10900000
10833333
10866666
11033333
10966666
10933333
11000000
11066666
11166666
11100000
11133333
11300000
11233333
11200000
11266666
11433333
11366666
11333333
11400000
11566666
11500000
11466666
11533333
11666666
11600000
11633333
11800000
11733333
11700000
11766666
11900000
11833333
11866666
12000000
11933333
11966666
12033333
12066666
12166666
12100000
12133333
12300000
12233333
12200000
12266666
12433333
12366666
12333333
12400000
12566666
12500000
12466666
12533333
12700000
12633333
12600000
12666666
12833333
12766666
12733333
12800000
12966666
12900000
12866666
12933333
13033333
13000000
13066666
13166666
13100000
13133333
13300000
13233333
13200000
13266666
13433333
13366666
13333333
13400000
13566666
13500000
13466666
13533333
13666666
13600000
13633333
13800000
13733333
13700000
13766666
13900000
13833333
13866666
14000000
13933333
13966666
14033333
14066666
14166666
14100000
14133333
14300000
14233333
14200000
14266666
14433333
14366666
14333333
14400000
14566666
14500000
14466666
14533333
14666666
14600000
14633333
14733333
14700000
14833333
14766666
14800000
14966666
14900000
14866666
14933333
15033333
15000000
15066666
15166666
15100000
15133333
15300000
15233333
15200000
15266666
15433333
15366666
15333333
15400000
15566666
15500000
15466666
15533333
15666666
15600000
15633333
15800000
15733333
15700000
15766666
15900000
15833333
15866666
16033333
15966666
15933333
16000000
16066666
16166666
16100000
16133333
16300000
16233333
16200000
16266666
16433333
16366666
16333333
16400000
16566666
16500000
16466666
16533333
16666666
16600000
16633333
16800000
16733333
16700000
16766666
16900000
16833333
16866666
17000000
16933333
16966666
17033333
17066666
17166666
17100000
17133333
17300000
17233333
17200000
17266666
17433333
17366666
17333333
17400000
17566666
17500000
17466666
17533333
17700000
17633333
17600000
17666666
17833333
17766666
17733333
17800000
17966666
17900000
17866666
17933333
18033333
18000000
18066666
18166666
18100000
18133333
18300000
18233333
18200000
18266666
18433333
18366666
18333333
18400000
18566666
18500000
18466666
18533333
18666666
18600000
18633333
18800000
18733333
18700000
18766666
18900000
18833333
18866666
19000000
18933333
18966666
19033333
19066666
19166666
19100000
19133333
19300000
19233333
19200000
19266666
19366666
19333333
19500000
19433333
19400000
19466666
19633333
19566666
19533333
19600000
19766666
19700000
19666666
19733333
19900000
19833333
19800000
19866666
20000000
19933333
19966666
20033333
