{
  "apex-available": [
    "//apex_available:platform",
    "com.android.btservices",
    "com.android.compos",
    "com.android.resolv",
    "com.android.uwb",
    "com.android.virt"
  ],
  "dependencies": true,
  "device": true,
  "features": "default,extra_traits,std",
  "min-sdk-version": "29",
  "run": true,
  "tests": true,
  "vendor-available": true
}
