{
  "apex-available": [
    "//apex_available:platform",
    "com.android.compos",
    "com.android.virt"
  ],
  "dependencies": true,
  "device": true,
  "patch": "patches/Android.bp.patch",
  "features": "",
  "run": true,
  "tests": true
}
