{
  "package": {
    "virtio-bindings": {
      "device_supported": false,
      "host_first_multilib": true,
      "add_module_block": "cargo2android_module.bp.fragment"
    }
  },
  "run_cargo": false
}
