{
  "features": [
    "alloc",
    "zerovec"
  ],
  "ramdisk_available": true,
  "recovery_available": true,
  "vendor_ramdisk_available": true,
  "native_bridge_supported": true,
  "package": {
    "icu_locale_core": {
      "add_module_block": "icu4x_bionic_dep.bp.fragment"
    }
  }
}
