{
  "min_sdk_version": "29",
  "module_blocklist": [
    "bitflags_test_tests_compile"
  ],
  "module_name_overrides": {
    "bitflags_test_src_lib": "bitflags_test_src_lib-1.3.2",
    "bitflags_test_tests_basic": "bitflags_test_tests_basic-1.3.2",
    "libbitflags": "libbitflags-1.3.2",
    "external_rust_crates_bitflags_license": "external_rust_crates_bitflags-1.3.2_license"
  },
  "package": {
    "bitflags": {
      "dep_blocklist": [
        "libtrybuild"
      ]
    }
  },
  "run_cargo": false,
  "tests": true
}
