{
  "include/platform/FeaturesD3D_autogen.h":
    "9923fb44d0a6f31948d0c8f46ee1d9e2",
  "include/platform/FeaturesGL_autogen.h":
    "b559f25f72ed9e103c39ef7e130ca58c",
  "include/platform/FeaturesMtl_autogen.h":
    "2eae56120878fb633700e1cdf56557dd",
  "include/platform/FeaturesVk_autogen.h":
    "c0daa0104f737a5670a00e1183f4e300",
  "include/platform/FrontendFeatures_autogen.h":
    "834af301a444786b363a1005c80e1f53",
  "include/platform/d3d_features.json":
    "5f4e8c4cc64f0cc1ef6e658d2e443aa2",
  "include/platform/frontend_features.json":
    "25d9d337d95b97b69911332c76e2e5ab",
  "include/platform/gen_features.py":
    "062989f7a8f3ff3b383f98fc8908dc33",
  "include/platform/gl_features.json":
    "3fb9baa3748a8dd383cf189f1bc12d30",
  "include/platform/mtl_features.json":
    "383be09e93f3d28c79a9f36c186ae2d7",
  "include/platform/vk_features.json":
    "fca1269d2ae63781842f78ef1eaeefea",
  "util/angle_features_autogen.cpp":
    "c18ecaee137793f043e35996256ad8e6",
  "util/angle_features_autogen.h":
    "748e62a5172bb4d469e1a4dd7d1909fc"
}